{"text_format":"1","workbook":"xlsx","n_sheets":4,"sheets":["管理用","リスト","検索","QA"],"not_rendered":{"charts":0,"images":5,"macros":1,"external_links":0,"defined_names":2,"comments":0,"pivot_tables":0},"unopened":[],"bounds":{"document_bytes":16777216,"sheet_cells":100000,"rows_first":2000,"rows_last":500,"rows_between":2000,"halvings":0,"cell_chars":16384,"cell_head_chars":4096},"cells_cut":0,"cells_raw":0,"read":"whole","date_system":"1900"}

{"sheet":"管理用","index":0,"n_rows":225,"n_cols":9,"rows_kept":225,"cut":false,"hidden":true,"merged":[]}
["No.","大分類","小分類",null,"質問","回答","関連QA１","関連QA2","関連QA3"]
[2,"外部委託","実施方法",null,"特定保健指導の実施機関が、積極的支援及び動機付け支援の初回面接のみを別の実施機関に委託し、初回面接以外の支援、評価を直接行うことは可能か。","特定健診・特定保健指導の外部委託基準※第2の５の（13）において、「委託を受けた業務の全部又は主たる部分を再委託してはならない」と規定されている。\n特定保健指導は、医師、保健師、管理栄養士が初回面接時に策定する行動計画を基に対象者に対して支援・進捗管理等を行っていくものであり、行動計画を策定する初回面接は特定保健指導において重要な位置付けであるため、特定保健指導の「主たる部分」に該当することから、制度上初回面接の再委託は認められない。",135]
[135,"外部委託","実施方法",null,"特定健診・特定保健指導の外部委託基準※の特定保健指導の内容に関する基準に「科学的根拠に基づくとともに」とあるが、どのようなケースが科学的根拠に該当しないと言えるのか。\n\n※特定健康診査及び特定保健指導の実施に関する基準第一条第一項第十号の規定に基づき医師が必要と認めるときに行う健診項目","「科学的根拠」とは、特定のエビデンスを意味するものではなく、非科学的な実施方法ではなく、かつ、科学的な見地から概ね妥当と考えられる方法を用いることの意味である。",2]
[3,"外部委託","集合契約",null,"集合契約において、実施機関が年度途中に参加・脱退することは可能か。","年度途中の参加については、実施体制が十分に確立されていない等、各都道府県の保険者協議会（集合契約Aについては保険者中央組織）が必要と認めた場合で、新規条件での契約は行わず、既存の契約への追加（実施機関一覧表への追加）のみ行う場合に限り、認められる。なお、変更契約の締結は四半期末ごとに行う（３月は除く）。\n年度途中の脱退については、集合契約作業の負荷を考慮し、原則として行わない。",139,140]
[129,"外部委託","集合契約",null,"地区医師会等が集合契約における契約の相手先となるが、当該地区医師会等が直営の健診機関や検査機関を持たず、他の実施機関が特定健診を実施している場合、当該地区医師会等の位置づけはどのように考えたら良いか。","地区医師会等が契約の相手先となっているが、特定健診は、他の実施機関が行っている場合、当該地区医師会等は契約のとりまとめ機関となる。",141]
[139,"外部委託","集合契約",null,"代表保険者以外の契約当事者である保険者について、契約書またはその付属書類上に記名押印が必要か。","代表保険者に契約を委任していれば記名押印は不要。",3,140,144]
[140,"外部委託","集合契約",null,"集合契約において、ある保険者が支払不能となった場合、他の保険者が連帯して支払う必要があるのか。","委託料の支払いについては、契約内容に則って対応することになる。\nなお、集合契約における標準的な契約書の例では、各保険者が各実施機関にそれぞれ委託料を支払う契約内容となっている。",3,139]
[141,"外部委託","集合契約",null,"集合契約における標準的な契約書の例において、契約の相手先が●●市医師会となっているが、地域の医師会を代表して県医師会を契約の相手先にすることは可能か。","可能。なお、地域によって単価が異なる場合は、内訳表を複数とすることも考えられる。",129]
[142,"外部委託","集合契約",null,"市町村衛生部門が他の保険者から委託を受ける場合、集合契約とする必要があるのか。","集合契約・個別契約どちらの方式でも差し支えない。保険者ができる限り多くの対象者に、特定健診・特定保健指導が実施できるようにするためには、集合契約を締結することが効率的であるが、市町村衛生部門が限られた人数にしか特定健診・特定保健指導を実施しない場合は、個別契約を締結する方法も考えられる。",143]
[143,"外部委託","集合契約",null,"市町村国保において、集合契約における標準的な契約書の例に「特定保健指導については、実施機関が、前項の有効期間内に実施した特定健康診査の結果に基づく指導を行う対象者に限り、当該指導の終了（実績評価を行う完了のみならず、脱落や資格喪失による途中終了も含む）する日までを有効期間とする。」とあるが、年度をまたいだ場合は、債務負担行為が必要か。","初回面接終了後と実績評価終了後の２回払いの契約において、年度をまたいで特定保健指導を実施した場合は、n年度予算で１回目、n+1年度予算で２回目の支払いを行うことから、債務負担行為は必要とならない。",142]
[144,"外部委託","集合契約",null,"集合契約における標準的な契約書の例が示されているが、条文を変更・追加・削除することは可能か。","契約単価・委託項目（健診項目等）部分であれば変更可能。\n契約関係者の事務の煩雑さを解消するため、集合契約では、契約書のフォーマット（条項と内容）は、原則として全国統一としとしている。",144]
[36,"外部委託","その他",null,"特定保健指導については、特定健康診査及び特定保健指導の実施に関する基準第十六条第一項の規定に基づき厚生労働大臣が定める者(平成25年厚生労働省告示第92号)第２の５（13）の規定により、委託を受けた業務の全部又は主たる部分を再委託してはならないこととされている。\n対象者に実施される一連の保健指導の業務の一部である、初回面接の実施、支援計画の作成又は実績評価の実施において、保険者から直接委託を受けた保健指導機関が、当該保健指導機関と雇用関係にない専門職個人にこれらを実施させることについて、当該保健指導機関の統括者が、各対象者の指導期間を通して実施状況の把握等を行い、当該特定保健指導の適正な実施が確保されるよう統括していると判断できる場合、「業務の全部又は主たる部分を再委託」することに該当しないと解して差し支えないか。","差し支えない。",128]
[90,"外部委託","その他",null,"特定健診・特定保健指導を外部委託するにあたり、単価をどのように設定すればよいか。","厚生労働省の特設サイト（https://www.kikan-db.mhlw.go.jp/）にて、各実施機関の単価が検索可能なので、当該単価を参考に設定いただきたい。（2024年10月25日現在停止中）",92,121]
[92,"外部委託","その他",null,"市町村国保が特定健診・特定保健指導を行う場合、直営で行う場合と実施機関へ委託して行う場合で、基準単価や対象経費の算定に違いはあるのか。","市町村の直営で行う場合は市町村保健師等の人件費は実支出額に計上しない。なお、交付額は実支出額と基準額を比較して少ない方の額を補助の対象としており、基準額の元となる基準単価においては、市町村直営の場合と実施機関へ委託する場合とで差はない。",90,121]
[116,"外部委託","その他",null,"健診実施機関と保健指導実施機関を別々に外部委託することは可能か。","可能。"]
[117,"外部委託","その他",null,"市町村国保において、特定保健指導を保健センターで実施する場合、契約が必要か。\nまた、他の保険者が特定保健指導を保健センターに委託する場合、どのようにすれば良いか。","市町村国保が特定保健指導を保健センターで実施する場合は、市町村衛生部門への執行委任の方法をとることになる。\nまた、他の保険者が特定保健指導を保健センターに委託する場合は、市町村国保に特定保健指導の実施を委託し、市町村国保が市町村衛生部門へ執行委任することになる。"]
[118,"外部委託","その他",null,"特定保健指導を外部委託する際、成功報酬を設定することは可能か。","契約者間双方の合意があれば可能。"]
[119,"外部委託","その他",null,"特定健診・特定保健指導の外部委託先が、適切に委託業務を履行しているかどのように確認すれば良いか。","保険者においては、外部委託基準※に適合しているか適宜確認を行っていただき、特定健診・特定保健指導の質の改善を促すとともに、委託先が適切に業務を履行しておらず、かつ改善の見込みがない場合は、契約を更新するか等について検討・評価を行うことになる。\nまた、保険者協議会においては、都道府県の協力を得て、委託先の質に関する情報交換等を行い、保険者の取り組みを支援していただきたい。\n\n※特定健康診査及び特定保健指導の実施に関する基準第十六条第一項の規定に基づき厚生労働大臣が定める者（平成25年厚生労働省告示第92号）",120,122,124]
[120,"外部委託","その他",null,"特定健診・特定保健指導の外部委託を考えているが、どのように委託先を選定すればよいか。","社会保険診療報酬支払基金のホームページ（https://www.ssk.or.jp/kikankensaku/）において、市町村別に実施機関リストが公開されているので確認されたい。\nまた、外部委託基準※において、実施機関は委託基準を満たしていることを示すため「重要事項に関する規程の概要」をホームページ等に公開することとされているため、そちらも参考にしていただきたい。\n\n※特定健康診査及び特定保健指導の実施に関する基準第十六条第一項の規定に基づき厚生労働大臣が定める者（平成25年厚生労働省告示第92号）",119,122,124]
[121,"外部委託","その他",null,"特定健診・特定保健指導の単価について、国が示す基準はあるのか。","単価については、国が統一的に定めるのではなく、保険者が実施機関との契約により個別に定めることとなる。",90,92]
[122,"外部委託","その他",null,"外部委託先が不適切な処理をしていることが判明した場合、どのように対応すれば良いか。","保険者において、委託先の機関に対し改善を求めることとなるが、是正されない場合は、年度途中であっても契約又は民法の規定に従い契約の解除等が考えられる。\nなお、年度途中の解除まで至らない、あるいは解除に向けた手続を踏む時間がない等の理由で解除ができない場合でも、次年度の契約を結ばない等の対応を検討することが考えられる。",119,120,124]
[123,"外部委託","その他",null,"特定健診・特定保健指導を外部委託した場合の個人情報の取扱いはどのように対応すれば良いか。","保険者には、個人情報保護法に基づくガイドライン（「医療・介護関係事業者における個人情報の適切な取扱いのためのガイダンス」（平成29年４月14日厚生労働省）、「健康保険組合等における個人情報の適切な取扱いのためのガイダンス」（平成29年４月14日厚生労働省）、「国民健康保険組合における個人情報の適切な取扱いのためのガイダンス」（令和２年10月９日厚生労働省）等が定められており、このガイドラインにおいて委託先の監督が求められていることから、個人情報の厳重な管理や、目的外使用の禁止等を委託契約書に定めるとともに、委託先の契約遵守状況を管理する必要がある。"]
[124,"外部委託","その他",null,"外部委託先と年度をまたいで契約をすることは可能か。","契約期間については、契約者間で調整のうえ決定していただきたい。",119,120,122]
[125,"外部委託","その他",null,"地方自治法（昭和22年法律第67号）に基づく一部事務組合に特定健診を委託することは可能か。","一部事務組合であっても、外部委託基準※を満たしていれば可能。\n\n※特定健康診査及び特定保健指導の実施に関する基準第十六条第一項の規定に基づき厚生労働大臣が定める者（平成25年厚生労働省告示第92号）"]
[126,"外部委託","その他",null,"高齢者の医療の確保に関する法律（昭和57年法律第80号）第20条に「加入者が特定健康診査に相当する健康診査を受け、その結果を証明する書面の提出を受けたとき、又は第二十六条第二項の規定により特定健康診査に関する記録の送付を受けたときは、この限りでない。」とされているが、対象者が受診した健診機関が外部委託基準※に該当しない場合でも、特定健診とみなすことは可能か。\n\n※特定健康診査及び特定保健指導の実施に関する基準第十六条第一項の規定に基づき厚生労働大臣が定める者（平成25年厚生労働省告示第92号）","可能。同法第21条による他の法令に基づく健康診断との関係についても同様。",133]
[128,"外部委託","その他",null,"特定健診において、再委託できる業務は何か。","検査の実施以外の健診データ作成業務や受付業務等の事務処理については、再委託可能である。また、その場合「運営についての重要事項に関する規定の概要」への記載も不要である。\n検査の実施については、血液検査や眼底検査等で検査体制・設備等を自機関内に保有しない健診機関は、その部分に限り、再委託をすることができる。なお、健診項目を再委託する場合は、「運営についての重要事項に関する規定の概要」に再委託先を記載しなければならない。",36]
[130,"外部委託","その他",null,"地区医師会等が契約のとりまとめのみを行っている場合でも、当該地区医師会等が「特定健康診査・特定保健指導の円滑な実施に向けた手引き」に定める「重要事項に関する規程の概要」を公表しなければならないのか。","契約のとりまとめのみを行っている場合は、「重要事項に関する規程の概要」を公表する必要はない。\nなお、当該地区医師会等が健診センターを保有し、実施機関として健診等を実施する場合は、公表しなければならない。",134,146,147]
[131,"外部委託","その他",null,"市町村国保において、市町村衛生部門が特定健診・特定保健指導を実施する場合、「特定健康診査・特定保健指導の円滑な実施に向けた手引き」で定める「重要事項に関する規程の概要」を公表する必要があるのか。","市町村国保からの執行委任であれば「重要事項に関する規程の概要」を公開する必要はない。\nなお、当該衛生部門が他の保険者から委託を受けて特定健診・特定保健指導を実施する場合は、外部委託に該当するため公表する必要がある。",137,145]
[132,"外部委託","その他",null,"市町村国保において、特定健診・特定保健指導の請求は、国民健康保険団体連合会（以下「国保連合会」という。）を経由しなければならないのか。","集合契約の場合は、代行機関（市町村国保の場合は国保連合会）を経由して、請求・費用決済処理を行う必要があるが、個別契約の場合は、締結した契約内容に応じ、契約者間で請求・費用決済処理を行うことも可能。"]
[133,"外部委託","その他",null,"保険者自身が特定健診を実施する場合でも、外部委託基準※第1の5にあるとおり重要事項に関する規程を定め、当該規程の概要をホームページ等で公表する必要があるのか。\n\n※特定健康診査及び特定保健指導の実施に関する基準第一条第一項第十号の規定に基づき医師が必要と認めるときに行う健診項目","重要事項に関する規程については、保険者自身が特定健診を実施する場合においても外部委託に準じて規程の作成・周知をしていただきたい。",126]
[134,"外部委託","その他",null,"重要事項に関する規程について、地域の医師会等が地域内の実施機関をとりまとめて一つの重要事項に関する規程を作成することは可能か。","複数の実施拠点を有する機関が、機関単位で重要事項に関する規程を作成した場合、保険者にとって利用するサービスの拠点が基準を満たしているか否かが分かりにくいだけでなく、拠点によって実施時間（営業している曜日や時間帯）等が異なる場合に、受診者にとってもわかりにくくなることから、重要事項に関する規程については、実施拠点単位で作成する必要がある。",130,146,147]
[137,"外部委託","その他",null,"市町村が健康保険組合等から特定健診・特定保健指導の委託を受ける場合、市町村国保ではなく、市町村衛生部門で受け入れることは可能か。","市町村衛生部門へ執行委任すれば可能。",131,145]
[138,"外部委託","その他",null,"厚生労働省のホームページに集合契約における標準的な契約書の例を公開しているが、個別契約においても当該契約書の例を利用しても良いか。","個別契約において、当該契約書の例を適宜修正し利用することは差し支えない。"]
[145,"外部委託","その他",null,"保険者自身が特定健診・特定保健指導を直接実施する場合や市町村国保が特定健診・特定保健指導を衛生部門に執行委任する場合は、健診・保健指導機関番号取得申請は必要か。","不要。なお、他の保険者からの委託を受け、他の保険者の加入者に対し特定健診・特定保健指導を実施する場合は必要。",131,137]
[146,"外部委託","その他",null,"地域の医師会等が医療機関等から職員を派遣してもらい、特定健診・特定保健指導を実施している場合、当該医療機関等についても健診・保健指導機関番号取得申請は必要か。","実施主体が地区医師会等である場合は、当該地域の医師会等が健診・保健指導機関番号取得申請をする必要がある。職員を派遣している医療機関等については、他の保険者の加入者に対し特定健診・特定保健指導を実施しない場合は不要。",130,134,147]
[147,"外部委託","その他",null,"地区医師会等が契約のとりまとめのみを行っている場合でも、地区医師会等による健診・保健指導機関番号取得申請は必要か。","不要。",130,134,146]
[127,"外部委託","結果通知表",null,"特定健診・特定保健指導の外部委託基準※に「特定健康診査の結果の受診者への通知に関しては、当該受診者における特定健康診査の結果の経年管理に資する形式により行われるようにすること。」が挙げられているが、実施機関から健診結果通知をしない場合でも、当該基準を満たす必要があるのか。\n\n※特定健康診査及び特定保健指導の実施に関する基準第十六条第一項の規定に基づき厚生労働大臣が定める者（平成25年厚生労働省告示第92号）","当該外部委託基準については、結果通知に当たって経年管理に資するよう形式を用意するよう求めているものであり、当該形式により通知を行うことを委託の要件とするものではない。"]
[84,"その他",null,null,"特定健康診査等実施計画の作成主体はどこか。","保険者ごとに作成していただきたい。\nただし、国民健康保険においては市町村または広域連合ごとに作成する必要がある。",85,87]
[85,"その他",null,null,"特定健康診査等実施計画は、国や都道府県に提出が必要か。","提出は必要ないが、都道府県においては、都道府県医療費適正化計画の作成・評価を行うため、自都道府県内の代表的な保険者の特定健康診査等実施計画やその評価結果の提出を求めることも考えられる。",84,87]
[87,"その他",null,null,"複数の支部を有する健康保険組合において、支部ごとに特定健康診査等実施計画を作成する必要があるのか。","特定健康診査等実施計画は、保険者単位で策定するため、複数の支部を有する健康保険組合であっても一つの実施計画を作成すれば良いが、支部ごとに実施計画を作成することを妨げるものではない。",84,85]
[88,"その他",null,null,"市町村国保が実施する特定健診・特定保健指導に要する経費の１/３は、市町村国保で負担しなければならないが、これらに要する経費について、交付税等の財政措置はされるのか。","市町村負担となる1/3については、交付税等の財政措置はない。市町村において国民健康保険特別会計の中での予算確保が必要となる。",154,155,156]
[149,"その他",null,null,"保険者協議会において、どのように特定健診・特定保健指導に係る保険者間の調整を実施しているのか。","被扶養者の健診を市町村国保に委託して実施する場合や集合契約により実施する場合には、保険者協議会を通じて市町村国保の契約情報や保険者とりまとめ団体の契約情報を収集し、委託から契約締結、実施までを効率的に進めている事例がある。\nまた、このような保険者間の調整の他に、特定健診・保健指導の実施率の高い保険者の取組事例の共有や保険者協働での広報活動等も行っている事例がある。"]
[150,"その他",null,null,"特定健診・特定保健指導の委託費用は、消費税の非課税対象となるのか。","消費税の非課税措置の対象となるのは、高齢者医療確保法においては、同法に基づく療養の給付及び入院時食事療養費、入院時生活療養費、保険外併用療養費、療養費又は特別療養費の支給に係る療養並びに訪問看護療養費の支給に係る指定訪問看護（平成18年通常国会において成立した健康保険法等の一部を改正する法律において消費税法も改正（平成20年4月施行））となっており、この中に特定健診・特定保健指導は含まれない。\nしたがって、特定健診・特定保健指導に係る事業は非課税措置の対象とはならない。"]
[154,"その他",null,null,"市町村国保の特定健診・特定保健指導の財源については、国・県・市町村で１/３ずつ負担するが、このうち、市町村の負担分については、一般会計繰り入れで対応するのか、それとも保険料収入で対応することを原則とするのか。","特定健診・特定保健指導は保険者による保健事業（法定義務）であり、市町村負担分に係る財源については、基本的には保険料収入により賄っていただくこととなる。なお、一般会計からの繰り入れ等については、各市町村の判断による。",88,155,156]
[155,"その他",null,null,"特定健診・特定保健指導に要する経費については、政令の定めるところにより国・都道府県がそれぞれ１/３を負担することとされている。\n残り１/３の市町村国保負担分の一部について、特別交付金等において上乗せ等をして交付することは可能か。","特に規定等はないので、各都道府県の判断となる。",88,154,156]
[156,"その他",null,null,"市町村国保が被用者保険の委託を受けて、被扶養者等に対して特定健診・特定保健指導を実施した場合の費用負担は、国、県で２/３を負担するが、１/３は市町村が負担するのか。","被用者保険が、その被扶養者に対する特定健診・特定保健指導について、市町村国保等に委託する場合、その費用については、当該被用者保険による負担となる。（被用者保険が補助の対象となり、市町村国保は補助の対象とはならない。）",88,154,155]
[157,"その他",null,null,"特定健診・特定保健指導に要する経費は、当該年度終了後に確定することから、国民健康保険法に基づく負担金の精算行為は当該年度の翌年度になるという理解でよいのか。","貴見のとおり。"]
[69,"特定健診","階層化",null,"特定健診後、初回面接までに本人の努力によって腹囲が基準値以下に減少した場合でも、健診結果に基づき階層化するのか。","貴見のとおり。",70]
[70,"特定健診","階層化",null,"特定健診時に把握した喫煙状況が誤りであったことが判明した場合、健診データを修正し、保健指導レベルも変更して対応するのか。","保険者が委託により特定健康診査を実施している場合は、保険者が委託先の実施機関から当該結果を受領し、そのまま実績報告することとなるが、委託先において記録されている内容に誤りがある場合は、委託先に修正させることとなる。なお、報告期限に間に合わない等特段の事情がある場合は、保険者にて修正することも考えられる。",69]
[28,"特定健診","健診項目",null,"腹囲の測定と内臓脂肪面積の測定を同時期に行った場合、特定保健指導の対象者の階層化に当たっては、どちらが優先されるのか。","階層化においては、内臓脂肪面積の結果を優先的に用いて対象者か否かを判定する。\n\n【根拠通知】\n「保険者が社会保険診療報酬支払基金に提出する令和６年度以降に実施した特定健康診査等の実施状況に関する結果について」（令和５年３月31日保発0331第４号厚生労働省保険局長通知）",50,58]
[50,"特定健診","健診項目",null,"健診項目に欠損がある場合や「医師の判断」欄に記載がない場合、どのように取り扱えば良いか。","医師の判断を含む特定健診の必須項目をすべて満たしていなければ、特定健診を実施したことにならない。\nなお、保険者が労働安全衛生法（昭和47年法律第57号）に基づく事業主健診等結果の提供を受けていれば、特定健診を実施したことに代えられるが、喫煙歴や服薬歴等の特定健康診査及び特定保健指導の実施に関する基準（平成19年厚生労働省令第157号）に示す必須項目が欠損していた場合、保険者にて追加実施する必要が生じる。",28,58]
[58,"特定健診","健診項目",null,"特定健診の項目以外の検査等を上乗せして実施した場合、当該健診項目の結果及び当該健診項目に係る「医師の判断」欄を特定健診の結果通知表に追加することは可能か。","「特定健康診査・特定保健指導の円滑な実施に向けた手引き」で示している特定健康診査受診結果通知表の記載事項を満たしていれば、上乗せ健診項目の結果を追加で記載しても差し支えない。\nしかし、上乗せ健診の結果も含めた内容により受診勧奨等何らかの指導を行うことは、特定健診に基づいた判断ではなくなることから、上乗せ健診にかかる医師の判断については、特定健診の医師の判断とは別に、総合判定や医師の判断欄などを設け記載する必要がある。",28,50]
[22,"特定健診","実施方法",null,"郵送による健診は、特定健診の実施として認められるか。","精度管理の観点や、身体診察の実施ができないことから、特定健診として認められない。",26,27,30]
[26,"特定健診","実施方法",null,"年度をまたいで、健診を複数回に分けて実施した場合、特定健診を実施したことになるのか。","健診を複数回に分けて実施する場合、すべて同一年度内に実施しなければ、特定健診を実施したことにならない。なお、詳細な健診の項目※も同様。\n\n※特定健康診査及び特定保健指導の実施に関する基準第一条第一項第十号の規定に基づき医師が必要と認めるときに行う健診項目",22,27,30]
[27,"特定健診","実施方法",null,"事業主健診で認められている腹囲の簡易な測定方法※は、特定健診で用いることは可能か。\n\n※「労働安全衛生規則の一部を改正する省令の施行及び平成10年労働省告示第88号（労働安全衛生規則第44条第3項の規定に基づき労働大臣が定める基準を定める件）の一部を改正する件の適用について」（平成20年1月21日基発第0121001号厚生労働省労働基準局長通知）に記載する腹囲の簡易な測定方法","可能。",22,26,30]
[30,"特定健診","実施方法",null,"車椅子等の方で、基準どおりに測定できない場合は、どのようにしたらよいか。","例外的な取扱として、代替可能な方法で実施することは差し支えない。\n例）\n・身長の計測を過去の測定結果の自己申告などにより対応\n・腹囲の測定を可能な限り通知で示した方法により座ったまま測定",22,26,27]
[54,"特定健診","実績評価",null,"健診項目の一部に欠損があるが、欠損している検査項目がなくとも、他の検査項目により、保健指導レベル判定、メタボリックシンドローム判定の結果が確定できる者については、実績報告でどのように扱えば良いか。","特定健康診査受診者数については、基本的な健診項目をすべて実施した者のみを含めることとしており、一部に欠損がある者については、特定健康診査受診者数には含めない。\n一方、評価対象者（特定健診の「基本的な健診項目」のすべてを実施していないものの、階層化に必要な項目は実施している者）については、特定保健指導を実施することは可能であるため、評価対象者数に含める。",148,159,192]
[148,"特定健診","実績報告",null,"実績報告において、他の健康診断に関する記録の写しを受領する場合でも対象者の郵便番号や住所は、必ず報告しなければならないのか。","住所や郵便番号は、住所をキーとした加入者の医療費分析・地域別分析等、保険者機能を発揮する上で必要不可欠な情報であり、また、受診者の管理は保険者として極めて重要であることから、保険者において管理している加入者の住所情報を用いるか、あるいは受診者本人から収集し記録する必要がある。",54,159,192]
[159,"特定健診","実績報告",null,"尿検査で４＋以上の結果が出た場合、実績報告時はどのように記録すれば良いか。","「５.+++」と記録すること。",54,148,192]
[192,"特定健診","実績報告",null,"基本的な健診の項目である身体計測（腹囲又は内臓脂肪面積）、血中脂質検査（LDLコレステロール又はNon-HDLコレステロール）及び血糖検査（空腹時血糖又はHbA1c、随時血糖又はHbA1c）において、それぞれの項目で複数の検査結果を保険者が保有している場合や、詳細な健診の項目において、実施できる条件に該当しない者の詳細な健診の項目に係る検査結果を保険者が保有している場合（血清クレアチニン検査を一律に実施している等）は、健診情報の管理等のため、社会保険診療報酬支払基金又は国民健康保険中央会に当該検査結果を含む健診結果を提出しても差し支えないか。","差し支えない。",54,148,159]
[46,"特定健診","その他",null,"食直後、食後の違いは何か。また、空腹時とは何時間をいうのか。","食直後は食事開始時から起算し、3.5時間未満を指す。食後は食事終了時から起算する。また、空腹時とは、食後10時間以上をいう。"]
[61,"特定健診","その他",null,"診療と特定健診を同日に実施することは可能か。また、診療の検査項目と健診項目が重複する場合、どのように取り扱えば良いか。","診療と特定健診を同日に実施することは可能。\n診療の検査項目と健診項目が重複する場合の取扱いについては、①特定健診を優先的に実施し、特定健診以外の部分は診療として実施する方法と②診療としての検査等を優先的に行い、特定健診として不足している部分については、保険者と当該医療機関との間で実施単価を取り決めた上で実施する方法が考えられるが、どちらを選択しても差し支えない。"]
[89,"特定健診","その他",null,"特定健診において、市町村国保で被用者保険の被扶養者の委託を受けた場合、市町村によっては、上乗せした健診項目を設けるところがあるが、費用負担についてはどのように取り扱えば良いか。\nまた、委託を受けた市町村国保が衛生部門に執行委任をしており、当該衛生部門が特定健診に上乗せした健診項目を実施している場合、当該上乗せした健診項目に係る費用の取扱いはどのようにすれば良いか。","市町村国保が独自に上乗せ健診を行う場合、実施機関と被用者保険の保険者が被用者保険側に係る上乗せ健診の実施の有無や費用負担のあり方等について合意する必要がある。\nなお、衛生部門に特定健診に上乗せした健診項目の実施義務がある場合、衛生部門が行うべき健診項目を市町村国保が費用を負担して実施することがないよう留意すること。"]
[136,"特定健診","その他",null,"受診者の携帯電話番号等、特定健診情報以外の情報を実施機関から保険者に提供してもらうことは可能か。","受診者から同意を得たときに限り、提供可能。"]
[8,"特定健診","対象者",null,"特定健康診査及び特定保健指導の実施に関する基準第一条第一項の規定に基づき厚生労働大臣が定める者（平成20年厚生労働省告示第３号）の六の解釈として、高齢者の医療の確保に関する法律（昭和57年法律第80号）第55条第１項第２号から第５号までに規定する施設において、通所型施設に通所している者は特定健診の対象から除外されるのか。","除外されない。高齢者の医療の確保に関する法律第55条第１項第２号から第５号までに規定する施設に入所又は入居している者のみが特定健診の対象外となる。",9,13,42]
[9,"特定健診","対象者",null,"特定健康診査及び特定保健指導の実施に関する基準第一条第一項の規定に基づき厚生労働大臣が定める者（平成20年厚生労働省告示第３号）の六の解釈として、高齢者の医療の確保に関する法律（昭和57年法律第80号）第55条第１項第５号に規定されている「介護保険法第８条第11項に規定する特定施設への入居」する者には、特定施設入居者生活介護の指定を受けていない特定施設（住宅型有料老人ホーム等）の入居者も含まれるか。","含まれる。\n（介護保険法第８条第11項に規定する特定施設としての要件を満たす特定施設であれば、「特定施設入居者生活介護の指定」の有無にかかわらず高齢者の医療の確保に関する法律第55条第１項第５号に規定する施設に該当し、当該施設に入所又は入居している者は特定健診等の対象から除外される。）",8,13,42]
[10,"特定健診","対象者",null,"特定健康診査及び特定保健指導の実施に関する基準第一条第一項の規定に基づき厚生労働大臣が定める者（平成20年厚生労働省告示第３号）の六の解釈として、高齢者の医療の確保に関する法律（昭和57年法律第80号）第55条第１項第４号が、「老人福祉法第20条の４又は第20条の５に規定する養護老人ホーム又は特別養護老人ホームへの入所（同法第11条第１項第１号又は第２号の規定による入所措置が採られた場合に限る）」となっているが、特定健診等が除外になる者は、住民票の異動や括弧内の措置は関係なく、特別養護老人ホームや養護老人ホームに入所している者全員と考えてよいか。","全員対象となる。なお、高齢者医療確保法第55条第１項第４号における「（同法第11条第１項第１号又は２号の規定による入所処置が採られた場合に限る。）」は、後期高齢者の被保険者となる要件として、例外的に、老人福祉法に規定する養護老人ホーム又は特別養護老人ホームへ入所している場合に、入所前の住所地を管轄する後期高齢者医療広域連合が行う後期高齢者医療の被保険者とする際の条件であり、特定健診の対象者に係る規定ではない。",9]
[13,"特定健診","対象者",null,"特定健康診査及び特定保健指導の実施に関する基準第１条第１項の規定に基づき厚生労働大臣が定める者（平成20年厚生労働省告示第３号）の六について、住民票をその施設に異動している者だけが特定健診の除外者となるのか。","住民票の異動に関わらず、当該施設に入所等している者は、特定健診の除外対象者となる。",8,9,42]
[14,"特定健診","対象者",null,"特定健康診査及び特定保健指導の実施に関する基準第１条第１項の規定に基づき厚生労働大臣が定める者（平成20年厚生労働省告示第３号）の一に規定する「妊産婦」とは、どの程度の期間を指すのか。","「妊産婦」は母子保健法における定義（「妊娠中又は出産後１年以内の女子をいう」）と同様である。"]
[17,"特定健診","対象者",null,"特定健康診査及び特定保健指導の実施に関する基準第１条第１項の規定に基づき厚生労働大臣が定める者（平成20年厚生労働省告示第３号）の第五号に規定する「病院又は診療所に６ヶ月以上継続して入院している者」について、４月１日現在の状況をレセプトで確認できるのは６月以降になる。３月31日以前の状況で判断しても良いか。","当該年度の除外対象者を判断するためには、前年度の３月31日以前の状況では不十分であるが、４月１日時点で必ずしも除外しなければならないものではなく、事後に確認できた段階で除外することができる。",18,39]
[18,"特定健診","対象者",null,"特定健康診査及び特定保健指導の実施に関する基準第１条第１項の規定に基づき厚生労働大臣が定める者（平成20年厚生労働省告示第３号）の第五号に規定する「病院又は診療所に６ヶ月以上継続して入院している者」について、当該期間中に転院した場合、継続して入院したことには該当するのか。","転院については、入院が継続されているものとみなす。",17,39]
[23,"特定健診","対象者",null,"特例退職被保険者（被扶養者）や任意継続被保険者（被扶養者）についても、強制加入被保険者（被扶養者）と同様に特定健診の実施が必須なのか。","必須である。"]
[38,"特定健診","対象者",null,"実施年度中に75歳になる74歳の者も特定健診の対象となるのか。\nまた、実施年度中に40歳になる39歳の者も特定健診の対象となるのか","実施年度中に75歳に達する日の前日までは対象となる。また、実施年度中に40歳に到達する者については、40歳の誕生日が属する年度※から特定健診の対象者となる。\n\n※例えば４月１日生まれの者の場合は、誕生日当日（Ｘ年４月１日０ 時以降）が属する年度（Ｘ年４月１日～Ｘ＋１年３月31日）が該当する。",94]
[39,"特定健診","対象者",null,"６ヶ月以上継続して入院していないが、糖尿病等の生活習慣病の治療中の者は特定健診の対象者から除外できるか。","除外することはできない。",17,18]
[40,"特定健診","対象者",null,"年度途中で異動してきた者に対し、特定健診を行うことは可能か。","特定健診の対象者（実施率の算定の基となる、支払基金（国）への実施状況報告の対象となる者）については、特定健診の実施年度中に40～74歳となる者で、かつ当該実施年度の一年間を通じて加入している者としており、年度途中での加入・脱退等異動のあった者については、特定健診の対象にならない。　　\nただし、年度途中で異動してきた者に対し、保険者の判断で、特定健診を行うことを妨げるものではない。なお、この場合においても、当該年度の特定健康診査の実施率を算出するにあたっての分母、分子に含めることはできない。",15]
[41,"特定健診","対象者",null,"特定健康診査及び特定保健指導の実施に関する基準第１条第１項の規定に基づき厚生労働大臣が定める者（平成20年厚生労働省告示第３号）の各号に該当する者を特定健診の除外者とするためには、証明書が必要となるのか。","調査等監査があった場合に、特定健診の除外者になると証明できない限りは除外されないため、証明書（妊産婦なら母子手帳の写し等）を取得・保管しておく必要がある。"]
[42,"特定健診","対象者",null,"特定健康診査及び特定保健指導の実施に関する基準第１条第１項の規定に基づき厚生労働大臣が定める者（平成20年厚生労働省告示第３号）の第一号に規定する「妊産婦」であることが、出産手当金や出産育児一時金の給付を持って明確に妊産婦であると確認できる場合でも、本人の申請が必要か。\nまた、第六号について、住所地が除外対象施設にあり、または住所地特例申請を受けているため客観的に当該施設入所者であると判断できる場合においても、同様に本人の申請が必要か。","必ずしも本人の申請は必要ないが、保険者の責任において、調査等監査があった場合に除外対象者であることを証明する必要がある。",8,9,13]
[43,"特定健診","対象者",null,"人工透析の通院治療中の患者も特定健診の対象者となるのか。","対象となる。\nなお、人工透析を受けている者は、継続的に医療機関を受診して医学的管理がなされていることから、特定健診の実施については、本人の健康状態等を考慮したうえで特定健診受診の必要性を慎重に判断すべきである。医師の判断の結果により特定健診を実施しない場合においても、本人同意のもとで保険者が診療における検査データの提供を受け、高齢者の医療の確保に関する法律（昭和57年法律第80号）第20条の規定により特定健診のデータとして活用できるよう、かかりつけ医と十分に連携していただきたい。\nまた、上記のように特定健診を実施しない場合でも、特定健診・特定保健指導の実施率の算定においては、除外対象者とならないことに留意されたい。"]
[86,"特定健診","対象者",null,"生活習慣病で受療中の者は、特定健診の対象者となるのか。","対象となる。\nなお、特定保健指導の階層化においては、糖尿病、高血圧症又は脂質異常症の治療に係る薬剤を服用している者を除くこととしている。"]
[33,"特定健診","他の健診（検診）との関係",null,"加入者が独自に健診を受診し、当該健診の健診項目が特定健診の項目と合致していれば特定健診を受診したことになるのか。","高齢者の医療の確保に関する法律（昭和57年法律第80号）第20条により、加入者が特定健診に相当する健診を受け、その結果を証明する書面の提出を受けたときは、特定健診の実施義務が免除になる。",34,35,151]
{"$rows_left_out":146}
{"sheet":"リスト","index":1,"n_rows":20,"n_cols":2,"rows_kept":20,"cut":false,"hidden":true,"merged":[]}
["大分類","小分類"]
[]
["特定健診","対象者"]
["特定保健指導","健診項目"]
["特定健診/特定保健指導","他法令との関係"]
["補助金","階層化"]
["外部委託","実施方法"]
["その他","集合契約"]
[null,"標準的な質問票"]
[null,"初回面接"]
[null,"実績評価"]
[null,"アウトカム評価"]
[null,"プロセス評価"]
[null,"行動変容"]
[null,"実績報告"]
[null,"詳細な健診の項目"]
[null,"他の健診（検診）との関係"]
[null,"結果通知表"]
[null,"ICT"]
[null,"その他"]

{"sheet":"検索","index":2,"n_rows":109,"n_cols":10,"rows_kept":109,"cut":false,"hidden":false,"merged":[[1,1,1,6]]}
["ver.1.0"]
[]
[]
[]
[]
[]
[]
[null,"No.","大分類","小分類",null,"質問","回答"]
[null,1]
[null,2]
[null,3]
[null,4]
[null,5]
[null,6]
[null,7]
[null,8]
[null,9]
[null,10]
[null,11]
[null,12]
[null,13]
[null,14]
[null,15]
[null,16]
[null,17]
[null,18]
[null,19]
[null,20]
[null,21]
[null,22]
[null,23]
[null,24]
[null,25]
[null,26]
[null,27]
[null,28]
[null,29]
[null,30]
[null,31]
[null,32]
[null,33]
[null,34]
[null,35]
[null,36]
[null,37]
[null,38]
[null,39]
[null,40]
[null,41]
[null,42]
[null,43]
[null,44]
[null,45]
[null,46]
[null,47]
[null,48]
[null,49]
[null,50]
[null,51]
[null,52]
[null,53]
[null,54]
[null,55]
[null,56]
[null,57]
[null,58]
[null,59]
[null,60]
[null,61]
[null,62]
[null,63]
[null,64]
[null,65]
[null,66]
[null,67]
[null,68]
[null,69]
[null,70]
[null,71]
[null,72]
{"$rows_left_out":30}
{"sheet":"QA","index":3,"n_rows":23,"n_cols":10,"rows_kept":23,"cut":false,"hidden":false,"merged":[[18,1,18,7],[19,1,19,7],[20,1,20,7],[21,1,21,7],[22,1,22,7],[16,1,16,7],[13,1,13,7],[14,1,14,7],[15,1,15,7],[17,1,17,7],[11,1,11,7],[12,1,12,7],[4,1,4,7],[5,1,5,7],[7,1,7,7],[8,1,8,7],[10,1,10,7]]}
[]
[null,"■　大分類",null,"■　小分類"]
[]
[]
[null,"■　質問"]
[]
[]
[null,"■　回答"]
[]
[]
[null,{"$f":"IF(B12<>\"\",\"■　関連QA\",\"\")","v":""}]
[null,{"$f":"IFERROR(IF(B13=\"\",\"\",\"質問\"),\"\")","v":""}]
[null,{"$f":"IFERROR(IF(J13=0,\"\",VLOOKUP(J13,管理用!$1:$1048576,5,0)),\"\")","v":""},null,null,null,null,null,null,null,{"$f":"VLOOKUP($A$1,管理用!$1:$1048576,7,0)","v":{"$error":"#N/A"}}]
[null,{"$f":"IFERROR(IF(B15=\"\",\"\",\"回答\"),\"\")","v":""}]
[null,{"$f":"IFERROR(IF(J13=0,\"\",VLOOKUP(J15,管理用!$1:$1048576,6,0)),\"\")","v":""},null,null,null,null,null,null,null,{"$f":"VLOOKUP($A$1,管理用!$1:$1048576,7,0)","v":{"$error":"#N/A"}}]
[null,{"$f":"IFERROR(IF(B17=\"\",\"\",\"質問\"),\"\")","v":""}]
[null,{"$f":"IFERROR(IF(J17=0,\"\",VLOOKUP(J17,管理用!$1:$1048576,5,0)),\"\")","v":""},null,null,null,null,null,null,null,{"$f":"VLOOKUP($A$1,管理用!$1:$1048576,8,0)","v":{"$error":"#N/A"}}]
[null,{"$f":"IFERROR(IF(B19=\"\",\"\",\"回答\"),\"\")","v":""}]
[null,{"$f":"IFERROR(IF(J17=0,\"\",VLOOKUP(J19,管理用!$1:$1048576,6,0)),\"\")","v":""},null,null,null,null,null,null,null,{"$f":"VLOOKUP($A$1,管理用!$1:$1048576,8,0)","v":{"$error":"#N/A"}}]
[null,{"$f":"IFERROR(IF(B21=\"\",\"\",\"質問\"),\"\")","v":""}]
[null,{"$f":"IFERROR(IF(J21=0,\"\",VLOOKUP(J21,管理用!$1:$1048576,5,0)),\"\")","v":""},null,null,null,null,null,null,null,{"$f":"VLOOKUP($A$1,管理用!$1:$1048576,9,0)","v":{"$error":"#N/A"}}]
[null,{"$f":"IFERROR(IF(B23=\"\",\"\",\"回答\"),\"\")","v":""}]
[null,{"$f":"IFERROR(IF(J21=0,\"\",VLOOKUP(J23,管理用!$1:$1048576,6,0)),\"\")","v":""},null,null,null,null,null,null,null,{"$f":"VLOOKUP($A$1,管理用!$1:$1048576,9,0)","v":{"$error":"#N/A"}}]