No,�s���{���R�[�h,�s���{����,�s�撬���R�[�h,�s�撬����,���l,���́i�ӂ肪�ȁj,����,�X�֔ԍ�,���ݒn�i�s���{������Ԓn�܂Łj,���ݒn�i�������E�����ԍ����j,�d�b�ԍ�,�Ώێ�,�������e,�^�c���i�����j�|�J�n,�^�c���i�����j�|�I��,�^�c���i�y�j�j�|�J�n,�^�c���i�y�j�j�|�I��,�^�c���i���j�j�|�J�n,�^�c���i���j�j�|�I��,�^�c���i�j���j�|�J�n,�^�c���i�j���j�|�I��,��x��,���,�����̌n,���H�̒񋟂̗L��,���H�������݂̉�,���}�̗L��,�ΏۃG���A,�������Ǝ��{�̗L��,���̑�,�@�l�ԍ��̗L��,�@�l�ԍ�,�@�l���́i�ӂ肪�ȁj,�@�l����,�X�e�[�^�X,�ܓx,�o�x
1,1,�k�C��,12033,���M�s,,��������ڂ����傤���Ђ��܂�,���\�h�����u�Ђ��܂�v,470001,���M�s��|��8-5,��|���,0134617268�i�암�n���x���Z���^�[�ցj,65�Έȏ�,�̑��i�^���j�A�F�m�Ǘ\�h,,,,,,,,,,,���z500�~�A���̑��X�|�[�c���S�ی���,0,1,0,,0,��2��i��2�E4�ؗj�j�A13��30���`15��,0,,,,���\,43.1805048,141.0261442
2,1,�k�C��,12033,���M�s,,��������ڂ����傤���@���������,���\�h�����u��������Q�v,470032,���M�s���5-10-1,���Ȃ����R�~���j�e�B�Z���^�[5�K,0134-32-4111�i���M�s�ցj,65�Έȏ�,�̑��i�^���j�A�F�m�Ǘ\�h,,,,,,,,,,,���z300�~�`500�~�A���̑��X�|�[�c���S�ی���,0,1,0,,0,��2��i��1�E3�ؗj�j�A10���`11��30��,0,,,,���\,43.2030095,140.9942556
3,1,�k�C��,12033,���M�s,,��������ڂ����傤���@�ĂƂ�,���\�h�����u��Ǝ�v,470016,���M�s�M����11-11,�M�����,0134-32-4111�i���M�s�ցj,65�Έȏ�,�̑��i�^���j�A�F�m�Ǘ\�h,,,,,,,,,,,���z300�~�`500�~�A���̑��X�|�[�c���S�ی���,0,1,0,,0,��2��i��2�E4���j�j�A13��30���`15��,0,,,,���\,43.1843924,141.0124376
4,1,�k�C��,12033,���M�s,,��������ڂ����傤���@�������傢��,���\�h�����u��������P�v,470033,���M�s�x��1-5-1,���U�w�K�v���U�i���s�I�j,0134-32-4111�i���M�s�ցj,65�Έȏ�,�̑��i�^���j�A�F�m�Ǘ\�h,,,,,,,,,,,���z300�~�`500�~�A���̑��X�|�[�c���S�ی���,0,1,0,,0,��2��i��2�E4���j�j�A10���`11��30��,0,,,,���\,43.19363159,140.994917
5,1,�k�C��,12033,���M�s,,��������ڂ����傤���@��������,���\�h�����u��������v,470013,���M�s����2-8-13,����{������,0134-32-4111�i���M�s�ցj,65�Έȏ�,�̑��i�^���j�A�F�m�Ǘ\�h,,,,,,,,,,,���z300�~�`500�~�A���̑��X�|�[�c���S�ی���,0,1,0,,0,��2��i��1�E3���j�j�A10���`11��30��,0,,,,���\,43.1766711,141.0033642
6,1,�k�C��,12033,���M�s,,��������ڂ����傤���@����܂�,���\�h�����u����܂v,470023,���M�s�ŏ�1-19-17,�ŏ���,0134-32-4111�i���M�s�ցj,65�Έȏ�,�̑��i�^���j�A�F�m�Ǘ\�h,,,,,,,,,,,���z300�~�`500�~�A���̑��X�|�[�c���S�ی���,0,1,0,,0,��2��i��2�E4���j�j�A10���`11��30��,0,,,,���\,43.1828324,140.9819103
7,1,�k�C��,12033,���M�s,,��������ڂ����傤���@���񂽂���,���\�h�����u��������v,470156,���M�s��1-4-16,�����M���,0134-32-4111�i���M�s�ցj,65�Έȏ�,�̑��i�^���j�A�F�m�Ǘ\�h,,,,,,,,,,,���z300�~�`500�~�A���̑��X�|�[�c���S�ی���,0,1,0,,0,��2��i��1�E3���j�j�A13��30���`15��,0,,,,���\,43.1778088,141.0353968
8,1,�k�C��,12033,���M�s,,��������ڂ����傤���@����,���\�h�����u ���C �v,470152,���M�s�V��2-13-4,�V�������,0134-32-4111�i���M�s�ցj,65�Έȏ�,�̑��i�^���j�A�F�m�Ǘ\�h,,,,,,,,,,,���z300�~�`500�~�A���̑��X�|�[�c���S�ی���,0,1,0,,0,��4��i��1�`��4�Ηj�j�A10���`11��30��,0,,,,���\,43.17305466,141.0569571
9,1,�k�C��,12033,���M�s,,��������ڂ����傤���@���܂���,���\�h�����u���܂���v,470264,���M�s�j����5-5,�j���\���؉��,0134-32-4111�i���M�s�ցj,65�Έȏ�,�̑��i�^���j�A�F�m�Ǘ\�h,,,,,,,,,,,���z300�~�`500�~�A���̑��X�|�[�c���S�ی���,0,1,0,,0,��2��i��1�E3���j�j�A10���`11��30��,0,,,,���\,43.1413765,141.1452804
10,1,�k�C��,12033,���M�s,,��������ڂ����傤���@���݂̂�,���\�h�����u���݂̂��v,470021,���M�s���D2-5-3,�Z�m�]���,0134-32-4111�i���M�s�ցj,65�Έȏ�,�̑��i�^���j�A�F�m�Ǘ\�h,,,,,,,,,,,���z300�~�`500�~�A���̑��X�|�[�c���S�ی���,0,1,0,,0,��2��i��2�E4�ؗj�j�A10���`11��30��,0,,,,���\,43.1855241,141.0023341
11,1,�k�C��,12033,���M�s,,��������ڂ����傤���@�Ȃ��݂���,���\�h�����u�Ȃ��݉�v,470261,���M�s�K��2-28-10,�K���s���Z���^�[��P�W�,0134-32-4111�i���M�s�ցj,65�Έȏ�,�̑��i�^���j�A�F�m�Ǘ\�h,,,,,,,,,,,���z300�~�`500�~�A���̑��X�|�[�c���S�ی���,0,1,0,,0,��2��i��2�E4���j�j�A10���`11��30��,0,,,,���\,43.13899459,141.1655223
12,1,�k�C��,12033,���M�s,,��������ڂ����傤���@�҂񂵂��,���\�h�����u�҂񂵂��v,470155,���M�s�]�m��2-2-11,�]�m�ӂꂠ���Z���^�[,0134-32-4111�i���M�s�ցj,65�Έȏ�,�̑��i�^���j�A�F�m�Ǘ\�h,,,,,,,,,,,���z300�~�`500�~�A���̑��X�|�[�c���S�ی���,0,1,0,,0,��2��i��1�E3���j�j�A10���`11��30��,0,,,,���\,43.16529748,141.0415406
13,1,�k�C��,12033,���M�s,,��������ڂ����傤���@�ӂꂠ��,���\�h�����u�ӂꂠ���v,470156,���M�s��1-19-20,�ӂꂠ����,0134-32-4111�i���M�s�ցj,65�Έȏ�,�̑��i�^���j�A�F�m�Ǘ\�h,,,,,,,,,,,���z300�~�`500�~�A���̑��X�|�[�c���S�ی���,0,1,0,,0,��2��i��1�E3���j�j�A10���`11��30��,0,,,,���\,43.1716616,141.0316318
14,1,�k�C��,12033,���M�s,,���ɂ����񂫂��傤���@��������,�V�j�A���C�����u���������v,470046,���M�s�Ԋ�1-21-4,�Ԋ���,0134-32-4111�i���M�s�ցj,65�Έȏ�,�̑��i�^���j�A�F�m�Ǘ\�h,,,,,,,,,,,���z300�~�`500�~�A���̑��X�|�[�c���S�ی���,0,1,0,,0,��2��i��2�E4���j�j�A10���`11��30��,0,,,,���\,43.22280092,140.9915772
15,1,�k�C��,12033,���M�s,,���ɂ����񂫂��傤���@������,�V�j�A���C�����u �΁@�� �v,470036,���M�s����5-1-1-27,���h���,0134-32-4111�i���M�s�ցj,65�Έȏ�,�̑��i�^���j�A�F�m�Ǘ\�h,,,,,,,,,,,���z300�~�`500�~�A���̑��X�|�[�c���S�ی���,0,1,0,,0,��4��i���T���j�j�A10���`11��30��,0,,,,���\,43.2074278,140.9785871
16,1,�k�C��,12033,���M�s,,���ɂ����񂫂��傤���@��������,�V�j�A���C�����u���������v,482672,���M�s���J1-18-7,���J���޽����,0134-32-4111�i���M�s�ցj,65�Έȏ�,�̑��i�^���j�A�F�m�Ǘ\�h,,,,,,,,,,,���z300�~�`500�~�A���̑��X�|�[�c���S�ی���,0,1,0,,0,��4��i���T�Ηj�j�A10���`11��30��,0,,,,���\,43.2093086,140.9219015
17,1,�k�C��,12033,���M�s,,���ɂ����񂫂��傤���@�Ȃ���,�V�j�A���C�����u�Ȃ��ځv,470036,���M�s�����R-11-�P,���a���,0134-32-4111�i���M�s�ցj,65�Έȏ�,�̑��i�^���j�A�F�m�Ǘ\�h,,,,,,,,,,,���z300�~�`500�~�A���̑��X�|�[�c���S�ی���,0,1,0,,0,��2��i��2�A��4�Ηj�j�A10���`11��30��,0,,,,���\,43.20953714,140.9810118
18,1,�k�C��,12033,���M�s,,���ɂ����񂫂��傤���@�͂҂˂�,�V�j�A���C�����u�͂҂˂��v,470037,���M�s�K3-28-5,�K���,0134-32-4111�i���M�s�ցj,65�Έȏ�,�̑��i�^���j�A�F�m�Ǘ\�h,,,,,,,,,,,���z300�~�`500�~�A���̑��X�|�[�c���S�ی���,0,1,0,,0,��2��i��2�E4���j�j�A10���`11��30��,0,,,,���\,43.21875875,140.9695378
19,1,�k�C��,12033,���M�s,,���ɂ����񂫂��傤���@�Ђ܂��,�V�j�A���C�����u�Ђ܂��v,482672,���M�s���J4-89,�ێR�����,0134-32-4111�i���M�s�ցj,65�Έȏ�,�̑��i�^���j�A�F�m�Ǘ\�h,,,,,,,,,,,���z300�~�`500�~�A���̑��X�|�[�c���S�ی���,0,1,0,,0,��2��i��1�E3���j�j�A10���`11��30��,0,,,,���\,43.20073074,140.9242486
20,1,�k�C��,12033,���M�s,,���ɂ����񂫂��傤���@�킢�킢,�V�j�A���C�����u�킢�킢�v,482671,���M�s�I�^���C1-25-1,�I�^���C���,0134-32-4111�i���M�s�ցj,65�Έȏ�,�̑��i�^���j�A�F�m�Ǘ\�h,,,,,,,,,,,���z300�~�`500�~�A���̑��X�|�[�c���S�ی���,0,1,0,,0,��3��i���j�j�A10��30���`12��,0,,,,���\,43.2196042,140.9604762
21,1,�k�C��,12033,���M�s,,���ɂ������������傤���@������,�V�j�A�̑������u ������ �v,470044,���M�s�~���}��10-3,�~�L���,0134-32-4111�i���M�s�ցj,65�Έȏ�,�̑��i�^���j�A�F�m�Ǘ\�h,,,,,,,,,,,���z300�~�`500�~�A���̑��X�|�[�c���S�ی���,0,1,0,,0,��2��i��2�E4�Ηj�j�A10���`11��30��,0,,,,���\,43.21309998,140.9944349
22,1,�k�C��,12033,���M�s,,�Ȃł��������������傤����,�Ȃł����̑�����,470152,���M�s�V��2-6-1,�������w�Z�����o��,0134-32-4111�i���M�s�ցj,65�Έȏ�,�̑��i�^���j�A�F�m�Ǘ\�h,,,,,,,,,,,���z300�~�`500�~�A���̑��X�|�[�c���S�ی���,0,1,0,,0,��2��i��2�E4�Ηj�j�A10���`11��30��,0,,,,���\,43.1737041,141.0576402
23,1,�k�C��,12033,���M�s,,�̂̂͂Ȃ����������傤���@����,��̉ԑ̑������i�T�j,470152,���M�s�V��3-7-1,�������w�Z�}����,0134-32-4111�i���M�s�ցj,65�Έȏ�,�̑��i�^���j�A�F�m�Ǘ\�h,,,,,,,,,,,���z300�~�`500�~�A���̑��X�|�[�c���S�ی���,0,1,0,,0,��2��i��1�E3���j�j�A10���`11��30��,0,,,,���\,43.1728242,141.0603871
24,1,�k�C��,12033,���M�s,,�̂̂͂Ȃ����������傤���@��,��̉ԑ̑������i�U�j,470152,���M�s�V��3-7-1,�������w�Z�}����,0134-32-4111�i���M�s�ցj,65�Έȏ�,�̑��i�^���j�A�F�m�Ǘ\�h,,,,,,,,,,,���z300�~�`500�~�A���̑��X�|�[�c���S�ی���,0,1,0,,0,��2��i��2�E4���j�j�A10���`11��30��,0,,,,���\,43.17270277,141.0603925
25,1,�k�C��,12033,���M�s,,�قق��݂��ӂ��Ă�,�قق��݃J�t�F�X,470016,���M�s�M����11-11,�M�����,0134-29-3708,���M�s��,���b��A�F�m�Ǘ\�h,,,,,,,,,,,,1,0,0,,0,�J�Ó��ɂ��Ă͂��⍇���肢�܂�,1,9.43001E+12,�Ƃ��Ă��Ђ����肩�ǂ��ق�����قق��݂����邨�񂪂���傤�ق����񂫂イ����,�����c�������@�l�قق��ݏ��M���y�Ö@������,���\,43.18442675,141.0124595
26,1,�k�C��,12041,����s,,�Ȃ���܂����炭�낤���񂭂�ԁi�܁[�����j,�i�R�i�y�V�l�N���u�i�����j,798411,�k�C������s�i�R�P���Q�Q���ڂS�|�Q,�i�y���,48-6102,�����ނ�60�Έȏ�̕�,������B�i���s�j����,9:00,16:00,9:00,16:00,9:00,16:00,,,,,�P�O�O�O�~�^�N,0,1,0,,0,���T���E�y�E���j��,0,,,,���\,43.8182936,142.4414507
27,1,�k�C��,12041,����s,,�Ȃ���܂����炭�낤���񂭂�ԁi���������j,�i�R�i�y�V�l�N���u�i�̑��j,798411,�k�C������s�i�R�P���Q�Q���ڂS�|�Q,�i�y���,48-6102,�����ނ�60�Έȏ�̕�,�̑��i�^���j�B,10:00,11:00,,,,,,,,,�P�O�O�O�~�^�N,0,0,0,,0,���T���j���i���s�j�i�P�P���`�S�������j,0,,,,���\,43.8182936,142.4414507
28,1,�k�C��,12041,����s,,�Ȃ���܂����炭�낤���񂭂�ԁi���킩���j,�i�R�i�y�V�l�N���u�i���b��j,798411,�k�C������s�i�R�P���Q�Q���ڂS�|�Q,�i�y���,48-6102,�����ނ�60�Έȏ�̕�,���b��,10:00,16:30,,,,,,,,,�P�O�O�O�~�^�N,0,1,0,,0,���T�ؗj��,0,,,,���\,43.8182936,142.4414507
29,1,�k�C��,12041,����s,,�Ȃ���܂����炭�낤���񂭂�ԁi�炶�����������j,�i�R�i�y�V�l�N���u�i���W�I�̑��j,798411,�k�C������s�i�R�P���Q�Q���ڂS�|�Q,�i�y���,48-6102,�����ނ�60�Έȏ�̕�,�̑��i�^���j�B�i���s�j���W�I�̑�,6:30,6:45,,,,,,,,,�P�O�O�O�~�^�N,0,0,0,,0,���T���E���j���i���s�j�i�T���`�P�O�������j,0,,,,���\,43.8182936,142.4414507
30,1,�k�C��,12041,����s,,����ǂ����[����@�܂���[��,�^���T�[�N���@�}�_���[��,788343,�k�C������s�����R���U���ڂS�|�U,���a�������,76-6020,,�̑��i�^���j�B�i���s�j�X�g���b�`�E�ؗ̓g���[�j���O,13:30,15:00,,,,,,,,20,�R�O�O�~�^��,0,1,0,,0,��P�E�R�ؗj��,0,,,,���\,43.7522442,142.4096971
31,1,�k�C��,12041,����s,,���܂��邭��ԂЂƂ肾��,�X�}�C���N���u��l�_���X,718132,�k�C������s���L�Q���W���ڂX�|�R,���L�����������,57-6103,,��H�B�i���s�j�_���X�A�J���I�P�A�����A�싅�A�p�[�N�S���t�A�\��G,10:00,15:00,,,,,,,,,�Q�O�O�O�~�^�N,0,1,0,���L���E���E��O������ߗ�,0,���T���E���E���j��,0,,,,���\,43.8121571,142.3917459
32,1,�k�C��,12041,����s,,�ق����񂰂񂫂����,�k�匳�C�N���u,700825,�k�C������s�k�咬�P�S���ڂQ�P�S�S�|�P�Q�X,�R�[�v�����ۂ눮��n��{��,46-6500,,�̑��i�^���j�B�u�b�E�X�g���b�`�E�؃g���E�]�g�����N,10:00,11:30,,,,,,,,,�Q�O�O�~�^��,0,1,0,,,���T���j��,0,,,,���\,43.78946158,142.3400163
33,1,�k�C��,12041,����s,,�����ڂ����傤�Ȃ����������������[����,�Ö]������̑��T�[�N��,700822,�k�C������s�����Q���ڂS�|�P,�Ö]������W�,46-6500,�Ö]��������,�̑��i�^���j�B�u�b�E�X�g���b�`�E�؃g���E�]�g�����N,14:00,15:00,,,,,,,,,����,0,1,0,�Ö]������,,��P�E�R�Ηj��,0,,,,���\,43.79382914,142.3134501
34,1,�k�C��,12041,����s,,�k���y�Α̑��N���u,�ق�����炭���傤�������������,700842,�k�C������s�咬�Q���P�O���ڂP�V�R�|�Q,�咬�k�����,46-6500,,�̑��i�^���j�B�u�b�E�X�g���b�`�E�؃g���E�]�g�����N,10:00,11:00,,,,,,,,,����,0,1,0,,,��P�E�R���j��,0,,,,���\,43.79199633,142.3541238
35,1,�k�C��,12041,����s,,�ȂȂ��܂ǂ����������[����,�ȂȂ��܂Ǒ̑��T�[�N��,700810,�k�C������s�{���Q���ڂS72�|�U�Q,���C�t�C�����Ƃ܂�,46-6500,���C�t�C�����Ƃ܂����Z��,�̑��i�^���j�B�u�b�E�X�g���b�`�E�؃g���E�]�g�����N,13:30,14:30,,,,,,,,,�����i�s���̍ێ����j,0,1,,,,��P�E�R���j��,0,,,,���\,43.78013096,142.3588138
36,1,�k�C��,12041,����s,,�Ђ����������͂����キ���,���鐲�����N���u,718160,�k�C������s���鐲�P�O���Q�P��,���鐲�����ف@��R����,57-5096,,������B�i���s�j�Q�[�g�{�[��,,,10:00,12:00,,,,,,,�Q�O�O�O�~�^�N,0,1,0,,0,���T�y�j��,0,,,,���\,43.88756372,142.4144917
37,1,�k�C��,12041,����s,,�Ƃ悳�Ƃӂꂠ�������,�L���ӂꂠ���T����,741182,�k�C������s�_�����L���R,�L�����,76-5511,,�F�m�Ǘ\�h�B�i���s�j��w�̑��E���o�̑��E�i���s�j�X�g���b�`�E�^���E�i���s�j�ǂݏ����v�Z�E���Y���̑���,10:00,14:00,,,,,,,,,����,1,1,1,�L���E�����n��,0,���T���j��,0,,,,���\,43.68313908,142.1784042
38,1,�k�C��,12041,����s,,�́[���E�����[�����������[����,�m�[�X�E�X�^�[�̑��T�[�N��,700825,�k�C������s�k�咬�W����,�k��������,46-6500,,�̑��i�^���j�B�i���s�j�u�b�E�X�g���b�`�E�i���s�j�؃g���E�]�g�����N,10:00,11:00,,,,,,,,,�P�O�O�~�^��,0,1,0,,0,��P�E�R���j��,0,,,,���\,43.78568002,142.3501102
39,1,�k�C��,12041,����s,,�����Ԃ݂낤���񂭂�Ԃ����������[����,�ߕ��V�l�N���u�̑��T�[�N��,700824,�k�C������s�Β��P�U���ڂR�O�P�Q�|�P�U,�ߕ��V�l�������̉�,46-6500,�ߕ��V�l�N���u���,�̑��i�^���j�B�i���s�j�u�b�E�X�g���b�`�E�i���s�j�؃g���E�]�g�����N,14:00,15:00,,,,,,,,,����,0,1,0,,0,��P�E�R���j��,0,,,,���\,43.78868594,142.3333519
40,1,�k�C��,12041,����s,,����΂������₩�����������[����,��[�����₩�̑��T�[�N��,700813,�k�C������s��[���R���V���ڂT�|�P�U,��[���,46-6500,,�̑��i�^���j�B�i���s�j�u�b�E�X�g���b�`�E�i���s�j�؃g���E�]�g�����N,14:00,15:00,,,,,,,,,����,0,1,0,,0,��P�E�R�ؗj��,0,,,,���\,43.7832963,142.3499615
41,1,�k�C��,12041,����s,,���т�����Ԃ����������[����,���т��N���u�̑��T�[�N��,700841,�k�C������s�咬�P���P�S���ڂQ�R�P�|�Q�X�Q,�咬�t���������,46-6500,���т��V�l�N���u���,�̑��i�^���j�B�i���s�j�u�b�E�X�g���b�`�E�i���s�j�؃g���E�]�g�����N,10:30,11:30,,,,,,,,,����,0,1,0,,0,��P�E�R���j��,0,,,,���\,43.79473733,142.3475881
42,1,�k�C��,12041,����s,,�ɂ����܂�������傭�������񂳁[����,�ђ��̗͑��i�T�[�N��,700824,�k�C������s�ђ��P�R����,�ђ��������,46-6500,,�̑��i�^���j�B�i���s�j�u�b�E�X�g���b�`�E�i���s�j�؃g���E�]�g�����N,10:00,11:00,,,,,,,,,�Q�O�O�~�^�N,0,1,0,,0,��Q�E�S���j��,0,,,,���\,43.78741422,142.3404112
43,1,�k�C��,12041,����s,,�Ђ܂�肩��,�Ђ܂���,718132,�k�C������s���L�Q���S���ڂW,���L�n��Z���^�[,76-5065,,�F�m�Ǘ\�h�B�i���s�j�v�Z�A���ǁA�]�g���A���N���G�[�V�����A�̑��A���o�̑���,10:00,11:30,,,,,,,,20,�T�O�O�~�^��,0,1,0,,0,���T�Ηj��,0,,,,���\,43.80829237,142.3837725
44,1,�k�C��,12041,����s,,�����Ђ낭�肷���邢�����̂���,���L�N���X�^���������̉�,718132,�k�C������s���L�Q���S���ڂW,���L�n��Z���^�[�@�Q�K�a��,52-3271,�N���X�^���V�l�N���u���,������B�i���s�j�����E���W�I�̑��E���b��E�J�[�h�Q�[���E�͌�,9:30,17:00,,,,,,,,,�P�W�O�O�~�^�N,0,1,0,,0,���T�΁E�ؗj��,0,,,,���\,43.80828188,142.3837823
45,1,�k�C��,12041,����s,,�Ƃ�̂ǂ�,�i�΂̂ǂ�,798431,�k�C������s�i�R���P�T���ڂP�P�U�|�S,�i�R��,40-2323,�����ނ�60�Έȏ�̕�,���b��B�i���s�j�u�b�E�̑�,,,10:00,12:00,,,,,,,����,1,0,1,�i�R�W�E�P�O�E�P�P�E�P�Q�E�P�R��,0,�y�j���i�s����j,0,,,,���\,43.8216929,142.4626116
46,1,�k�C��,12041,����s,,�Ƃ�̂ǂ�,�i�΂̂ǂ�,798431,�k�C������s�i�R���P�O���ڂQ�U�R�|�P,�T�����C�Y,40-2323,�����ނ�60�Έȏ�̕�,���b��B�i���s�j�u�b�E�̑�,,,,,10:00,12:00,,,,,����,1,0,1,�i�R�W�E�P�O�E�P�P�E�P�Q�E�P�R��,0,���j���i�s����j,0,,,,���\,43.8019514,142.445761
47,1,�k�C��,12041,����s,,�ӂ��[�炢�ӂ���͂Ȃ����,�ӂ��[�炢�ӃA���n�i�R,798413,�k�C������s�i�R�R���P�X���ڂS�|�P�T,�i�R�s���𗬃Z���^�[,090-9439-2983,�����ނ�60�Έȏ�̕�,������B�i���s�j�t�����[�A�����W�����g�i���s�j�v���U�[�u�h�t�����[,10:30,15:30,,,,,,,,,���ԂR�T�O�O�~�^��@�v���U�[�u�h�S�S�O�O�~�^��`�i�ޗ���j,0,0,0,,0,���T���j��,0,,,,���\,43.8106581,142.4369449
48,1,�k�C��,12041,����s,,�Ȃ���܂��񂭂ЂႭ���ォ���������イ�ǂ���������,�i�R�R��S����싅���D��,798413,�k�C������s�i�R�R���P�T���ڂP�|�S�R,�i�R�O����,48-4941,�����ނ�60�Έȏ�̕�,�̑��i�^���j�B�i���s�j�싅,9:00,12:00,,,,,,,,,�T�O�O�~�^�N,0,0,0,,0,���T������,0,,,,���\,43.804938,142.4265427
49,1,�k�C��,12041,����s,,�ꂢ�킩��,�ꂢ���,798415,�k�C������s�i�R�T���P�P���ڂQ�|�Q�O,�Έ㋦�Ȃ���܈�@,090-7055-7766�@48-8506,,������B�i���s�j�u�b�E�̑��E���b��E�J�[�����R��,13:30,15:30,,,,,,,,,�P�O�O�~�^��,1,1,0,,0,������S�Ηj��,0,,,,���\,43.7983296,142.4216597
50,1,�k�C��,12041,����s,,�Ղ���Ƃ��ӂ�,�Ղ���ƃJ�t�F,700001,�k�C������s�V�x�P���Q���ڂQ�ԂQ�V��,���������Z���^�[�V����,40-3003,,���b��B�i���s�j�k�b�A���肪�݁A�̑��Ȃ�,13:30,15:30,,,,,,,,,�P�O�O�~�^��,1,1,0,����s���i�ꕔ���}����j,0,��S�ؗj���i���s�j�i����̂݊����j,0,,,,���\,43.79217927,142.3844159
51,1,�k�C��,12041,����s,,�����킹�����ꂢ���Ⴂ�����̂����@���Ƃ����,�����킹����Ҍe���̉Ɓ@�X�g���b�`,798414,�k�C������s�i�R�S���V���ڂP�ԂQ�O��,�O�a���,40-3003,�����킹�N���u���,�̑��i�^���j�B�i���s�j�X�g���b�`,10:00,11:30,,,,,,,,25,�N���u������P�T�O�O�~�^�N�@�T�O�O�~�^��,1,1,0,,0,���T�ؗj��,0,,,,���\,43.7929673,142.4094677
52,1,�k�C��,12041,����s,,�Ȃ���܂邩�߂낤���񂭂�Ԃ��邱������,�i�R�ߋT�V�l�N���u�@���邱����,798414,�k�C������s�i�R�S���S���ڂP�O�|�Q�R,�Ђ܂����,40-3003,�V�l�N���u���,�̑��i�^���j�B�i���s�j�E�H�[�L���O,9:30,10:30,,,,,,,,,����,0,1,0,,0,��P�E�Q�E�S���j���i���s�j�i�Ċ��̂݊����j,0,,,,���\,43.7899699,142.4044207
53,1,�k�C��,12041,����s,,�ӂ܂˂��Ƃ��������݂񂩂����񂫂傤����,�ӂ܂˂��ƏH���s����ً���,798402,�k�C������s�H���Q���Q���ڂQ�|�P�T,�H���s�����,40-3003,,�̑��i�^���j�B�i���s�j�ӂ܂˂���,13:30,15:00,,,,,,,,20,�R�O�O�~�^��,0,1,0,����s��,0,��R�Ηj��,0,,,,���\,43.7921446,142.3919564
54,1,�k�C��,12041,����s,,�߂΂����񂱂������,�߂΂����N�N���u,788354,�k�C������s�����P�S���V���ڂR�|�P�O,�߂΂����,31-8856,60�Έȏ�̕�,�̑��i�^���j�B�i���s�j���\�h�̑��E���o�̑��E�]�g���E���Y���̑�,14:00,15:30,,,,,,,,,�S�O�O�~�^��,0,0,0,,0,��P�`�S���j��,0,,,,���\,43.74105455,142.4138662
55,1,�k�C��,12041,����s,,�������Ђ܂�肭���,�����Ђ܂��N���u,788237,�k�C������s�L���V���X���ڂP�|�P�U,����������,34-9185,65�Έȏ�̕�,�̑��i�^���j�B�i���s�j�X�g���b�`�E�؃g���E�]�g���E���\�h�̑���,13:30,14:30,,,,,,,,45,1000�~�^�N,0,1,0,,0,��P�`�S���j��,0,,,,���\,43.76256984,142.4201357
56,1,�k�C��,12041,����s,,�炭�炭�����,�炭�炭�N���u,788234,�k�C������s�L���S���U���ڂT,���ڂ��������,35-2275,65�Έȏ�̕�,�̑��i�^���j�B�i���s�j�X�g���b�`�E�؃g���E�]�g���E���\�h�̑���,13:30,15:00,,,,,,,,20,200�~�^��,0,1,0,,0,��P�E�R���j��,0,,,,���\,43.76059577,142.4101966
57,1,�k�C��,12041,����s,,���イ���������ӂꂠ�������,�����n��ӂꈧ���T����,700037,�k�C������s�T��ʂV���ڂP�O�V�O,�t�[�h�e���X,23-6022,,���b��B�i���s�j���������݂Ȃ���̌�,14:00,15:00,,,,,,,,,100�~�^��,1,1,0,,0,��R���j���i���s�j�i�S���`�X���Ɋ����j,0,,,,���\,43.7703017,142.3614879
58,1,�k�C��,12041,����s,,���イ���������ӂꂠ�������,�����n��ӂꈧ���T����,700037,�k�C������s�V��ʂV���ډE�P�O,�܂��Ȃ��Ԃ񂩏���,23-6022,,���b��B�i���s�j���������݂Ȃ���̌�,14:00,15:00,,,,,,,,,100�~�^��,1,1,0,,0,��R���j���i���s�j�i�P�O���`�R���Ɋ����j,0,,,,���\,43.77204267,142.3625293
59,1,�k�C��,12041,����s,,�Ƃ��ق����イ���������ӂꂠ�������,���L�����n��ӂꂠ���T����,788232,�k�C������s�L���Q���T���ڂU�|�R�T,���n��̈�Z���^�[,76-6020,65�Έȏ�̕�,���b��B�i���s�j���N���k�E�Q�[���E�́E�𗬁E���H�Ȃ�,10:00,14:00,,,,,,,,20,�T�O�O�~�^��,1,0,0,���L�����n��,0,��Q�E�S�ؗj��,0,,,,���\,43.757246,142.4060868
60,1,�k�C��,12041,����s,,�͂Ȃ��Ƃ������,�Ԃ��Ƃ��T����,788348,�k�C������s�����W���U���ڂP,�L���V�l�z�[���Ԃ��Ƃ�,76-6020,,�̑��i�^���j�B�i���s�j�X�g���b�`�E�ӂ܂˂���,14:00,15:30,,,,,,,,10,����,1,0,0,,0,��Q�E�S�Ηj��,0,,,,���\,43.74773287,142.4069943
61,1,�k�C��,12041,����s,,�Ƃ������Ƃ��̂���������������,�����F�̉�G�N�T�T�C�Y,788350,�k�C������s�����P�O���R���ڂR�|�P�S,����������,76-6020,,�̑��i�^���j�B�i���s�j�X�g���b�`�E�i���s�j�ؗ̓g���[�j���O�E�i���s�j�ӂ܂˂���,10:00,11:30,,,,,,,,40,����,0,1,0,,0,��Q�E�S�ؗj��,0,,,,���\,43.7454787,142.3979462
62,1,�k�C��,12041,����s,,���������Ƃ݂�܂������,�k�ʓs�{�O�T����,788391,�k�C������s�{�O�P���R���ڂR�|�R�O,����s�s�������𗬃Z���^�[CoCoDe,76-6020,,������B�i���s�j�y�^���E�����ԁE�u�b�E�J���^�E�H��@��,10:00,11:30,,,,,,,,15,����,1,0,0,,0,��S���j��,0,,,,���\,43.7568063,142.3718004
63,1,�k�C��,12041,����s,,�Ƃ��������񂫂���,�������C��,788346,�k�C������s�����U���S���ڂP�ԂP�R��,���L����҂������̉�,76-6020,,�̑��i�^���j�B�i���s�j�̑��E�ӂ܂˂��ƁE�i���s�j����ʁE�G�{�̓ǂݕ�������,10:00,11:30,,,,,,,,20,����,1,1,0,,0,��Q�E�S�Ηj��,0,,,,���\,43.74997786,142.4002238
64,1,�k�C��,12041,����s,,�ۂՂ�ق܂ꂱ�ƂԂ�����,�ۂՂ�ق܂����,788334,�k�C������s��S��ʂQ�R���ڂP�X�V�T�|�S�S�P,�ۂՂ獂��҂������̉�,76-6020,�V�l�N���u���,�̑��i�^���j�B�i���s�j�̑��E�ӂ܂˂��ƁE���̑̑�,10:00,11:30,,,,,,,,,�P�O�O�O�~�^�N,0,1,0,,0,��Q�E�S�y�j��,0,,,,���\,43.7533754,142.3802989
65,1,�k�C��,12041,����s,,������񂳁[����,�������T�[�N��,788352,�k�C������s�����P�Q���S���ڂR�|�R�P,��R�����c�n�@�Q�����W�,76-6020,,�̑��i�^���j�B�i���s�j�X�g���b�`�E�i���s�j�ؗ̓g���[�j���O�E�i���s�j�ӂ܂˂���,14:00,15:30,,,,,,,,15,�V�O�O�~�^��,0,1,0,,0,���T�Ηj��,0,,,,���\,43.7435837,142.4005228
66,1,�k�C��,12041,����s,,���������������̂����@���炨��,���������������̉Ɓ@�J���I�P,788232,�k�C������s�L���Q���V���ڂT�|�P�X,�L�����z�������,34-0134,60�Έȏ�̕�,������B�i���s�j�J���I�P,13:00,16:00,,,13:00,16:00,,,,,����,0,0,0,,0,��Q�E�S�ؗj���i���s�j��P�E�R�E�T���j,0,,,,���\,43.7566811,142.4144913
67,1,�k�C��,12041,����s,,���������������̂����@�������イ,���������������̉Ɓ@�싅,788232,�k�C������s�L���Q���V���ڂT�|�P�X,�L�����z�������,34-0134,60�Έȏ�̕�,�̑��i�^���j�B�i���s�j�싅,13:00,16:00,,,,,,,,,����,0,0,0,,0,��P�`�S���j���i���s�j�u�T���j��,0,,,,���\,43.7566811,142.4144913
68,1,�k�C��,12041,����s,,�u�������΁v,�u�������΁v,788261,�k�C������s�������P���U���ڂQ�|�S,�݂�Ȃ̂������u�������΁v,32-2287,60�Έȏ�̕�,�F�m�Ǘ\�h�B�i���s�j�]�g���E������𗬌𗬁E.�̑���,13:30,15:00,,,,,,,,,����,0,0,0,,0,���T���j��,0,,,,���\,43.7706296,142.4401308
69,1,�k�C��,12041,����s,,��΂������̂����@���炨��,�l�t�������̉Ɓ@�J���I�P,788261,�k�C������s�������P���Q���ڂQ�|�Q,��ʈ꒬�����,37-1188,60�Έȏ�̕�,������B�i���s�j�J���I�P,9:00,12:00,,,,,,,,,120�~�^��,0,0,0,,0,���T���j��,0,,,,���\,43.77112381,142.4262027
70,1,�k�C��,12041,����s,,��ӂ�����ク�񂱂�����ǂ����傤����,���t���b�V�����N�^������,788803,�k�C������s�΂��u���R���P���ڂP�O�|�R�O,�΂��u�n�抈���Z���^�[�i�O�����p���j,76-5288,,�̑��i�^���j�B�i���s�j�X�g���b�`��ȒP�ȃg���[�j���O,10:00,11:30,,,,,,,,20,�T�O�O�~�^��,0,0,0,,0,���T�ؗj��,0,,,,���\,43.72733965,142.3830417
71,1,�k�C��,12041,����s,,����Ƃ�����,�؃g�������,708003,�k�C������s�_�y�R���U���ڂP�|�P�Q,�_�y������,61-5693,,�̑��i�^���j�B,10:00,11:00,,,,,,,,15,����,0,0,0,�_�y�E�_�y���n��ߗ�,0,���T���j��,0,,,,���\,43.7607548,142.3494733
72,1,�k�C��,12041,����s,,���񂫂������I,���C����I,788322,�k�C������s�_�y���P�Q���Q���ڂQ�|�P,�_�y���c�n�R�����X�y�[�X,66-5351,,�̑��i�^���j�B,10:00,11:30,,,,,,,,10,�V�O�O�~�^��,0,1,0,,0,���T���j��,0,,,,���\,43.74522145,142.3591059
73,1,�k�C��,12041,����s,,����񂱂�����,�T������������,788373,�k�C������s���_�R���T���ڂU�|�V,���V�����ψ�����,65-6641,�����i�j���Q���͗v���k�j,���b��B,10:00,12:00,,,,,,,,10,�P�O�O�~�^��,1,1,0,���_�R���T���ڋߗ�,0,��Q���j��,0,,,,���\,43.7335488,142.3887777
74,1,�k�C��,12041,����s,,�炭�炭����ɂ������Ղ������[��,�y�炭�ؓ��A�b�v�_�y���[��,708005,�k�C������s�_�y�T���V���ڂR�|�V,���{�щ��,61-7264,,�̑��i�^���j�B,14:00,15:00,,,,,,,,20,����,0,0,0,�_�y�{���n��ߗ�,0,���T�Ηj��,0,,,,���\,43.7565755,142.3479768
75,1,�k�C��,12041,����s,,�����킿���@�͂܂Ȃ��̂���,���a�n��@�n�}�i�X�̉�,788381,�k�C������s���_�y1��17��,���a���,66-5351,,�̑��i�^���j�B,9:30,10:30,,,,,,,,12,����,0,0,0,,0,���T���j��,0,,,,���\,43.6663692,142.4042417
76,1,�k�C��,12041,����s,,�����炨������䂤�����,�_�y�����F�N���u,788322,�k�C������s�_�y���P�Q���Q���ڂR,�_�y���n��Z���^�[,66-5351,�_�y�����F�N���u���,������B�i���s�j���N�̑��E�J���I�P�E�t���A�J�[�����O�E�u�b��,,,,,,,,,,,�������e�ɂ��,0,0,0,,0,�s���,0,,,,���\,43.74505623,142.3586594
77,1,�k�C��,12041,����s,,���񂫂Ⴍ�����,���r�N���u,788322,�k�C������s�_�y���P�Q���Q���ڂR,�_�y���n��Z���^�[,66-5351,,�̑��i�^���j�B�i���s�jDVD�����đ̑��A�C���X�g���N�^�[�w���ɂ��̑�,10:00,11:30,,,,,,,,20,�P�T�O�O�~�^��,0,0,0,,0,��P�E�Q�E�R���j��,0,,,,���\,43.74508723,142.3586943
78,1,�k�C��,12041,����s,,���傤���񂽂�����,�Ό���������,788303,�k�C������s�΂��u�R���R����,�΂��u�Z���Z���^�[,66-5351,,�̑��i�^���j�B�i���s�j�]�g���A�΂����K,10:00,12:00,,,,,,,,20,�Q�O�O�~�^��,0,0,0,,0,���T���j��,0,,,,���\,43.73378585,142.3776011
79,1,�k�C��,12041,����s,,���Ɂ[���Ƃ���������������[����,�T�j�[�X�g���b�`�̑��T�[�N��,788804,�k�C������s�΂��u���S���Q���ڂP�|�R�O,�T�j�[�^�E���Z���Z���^�[,66-5351,����,�̑��i�^���j�B,10:10,11:40,,,,,,,,10,�Q�O�O�O�~�^��,0,0,0,,0,���T���j��,0,,,,���\,43.72406961,142.3817709
80,1,�k�C��,12041,����s,,���������݂ǂ肩��,���������݂ǂ��,788302,�k�C������s�΂��u�Q���Q����,��R�u���b�N�W�,66-5351,����,���b��B�i���s�j�k�b�E�]�g���E�G�莆�E�H�쓙,,,13:30,15:00,,,,,,6,�Q�O�O�~/��,1,1,0,�݂ǂ蒬����ߗ�,0,�����Q�E�S�y�j��,0,,,,���\,43.73572811,142.3801302
81,1,�k�C��,12041,����s,,�˂���̂���,�N�ւ̉�,788304,�k�C������s�΂��u�S���R����,�_�y���j���[�^�E���c�n�W�,66-5351,,������B�i���s�j�k�b�E�]�g���E�Q�[����,13:30,15:00,,,,,,,,,���̓��̎Q���҂ŉ���𕉒S�i�P�l�P�O�O�~�`�R�O�O�~���x�j,0,1,0,�΂��u�T���R���ڒ�����ߗ�,0,������Q���j��,0,,,,���\,43.73271525,142.3763643
82,1,�k�C��,12041,����s,,�����炨���ɂ��ɂ�����ǂ������,�_�y���ɂ��ɂ��^���N���u,788315,�k�C������s�_�y���T���S�ڂP�|�W,�_�y�����撬�����,66-5351,,�̑��i�^���j�B,10:00,11:15,,,,,,,,25,�U�O�O�~�^��,0,0,0,,0,��P�`�S�ؗj��,0,,,,���\,43.74442557,142.3719542
83,1,�k�C��,12041,����s,,���񂱂����������u�ǂ񂮂�̂����v,���N�̑��u�h���O���̉�v,708007,�k�C������s�_�y�V���P�P���ڂW�|�P,�����ّ�z�[��,66-5351,,�̑��i�^���j�B,13:00,14:00,,,,,,,,20,����,0,0,0,,0,���T�ؗj��,0,,,,���\,43.7498168,142.3510836
84,1,�k�C��,12041,����s,,���񂿂�񂭂��,�؂����N���u,788372,�k�C������s���_�Q���S���ڂW�|�Q�Q,���_�݂ǂ����,66-5351,,�̑��i�^���j�B,10:00,11:00,,,,,,,,15,�P�O�O�O�~�^��,0,0,0,,0,���T�ؗj��,0,,,,���\,43.73619282,142.3894416