{"text_format":"1","workbook":"xlsx","n_sheets":14,"sheets":["点検結果記載シート","評価区分シート","一括データ管理","一括データ管理_整形用","事業所別集計(レーダーチャート比較)","ケアマネジャー別集計(レーダーチャート比較)","一括データ管理_整形用(経年)","事業所別集計(経年表示-集合棒グラフ)","ケアマネジャー別集計(経年表示-集合棒グラフ)","アドバイス文に関する追加説明","算出パラメータ","算出シート","files","Config"],"not_rendered":{"charts":27,"images":11,"macros":1,"external_links":0,"defined_names":20,"comments":0,"pivot_tables":0},"unopened":[],"bounds":{"document_bytes":16777216,"sheet_cells":100000,"rows_first":2000,"rows_last":500,"rows_between":2000,"halvings":0,"cell_chars":16384,"cell_head_chars":4096},"cells_cut":0,"cells_raw":0,"read":"whole","date_system":"1900"}

{"sheet":"点検結果記載シート","index":0,"n_rows":74,"n_cols":8,"rows_kept":74,"cut":false,"hidden":false,"merged":[]}
["Ver 2.0.0"]
[]
[]
[]
[]
["区分","点検対象の書類","No","項目","点検結果","評価基準 ※明記されている場合を除き、「有」の条件が記載されていない場合を「無」とする。","運営基準","分類"]
[null,null,null,"点検日",null,"点検日を記入ください。"]
["属性情報","保険者",null,"市区町村名",null,"ご所属の市区町村名を記入ください。"]
["※集計用任意入力項目\n※判定には影響しません","点検者",null,"点検者名",null,"点検者名を記入ください。"]
[null,"ケアマネジャー",null,"ケアマネジャー名",null,"ケアマネジャー名を記入ください。"]
[null,"事業所",null,"事業所名",null,"事業所名を記入ください。"]
[null,"被保険者",null,"被保険者名",null,"被保険者を記入ください。"]
["ケアプラン点検","アセスメントシート",1,"課題分析の理由",null,"2：初回、更新、区変、プラン変更、退院、状態変化等の理由が記載されている。 \n1：初回、更新、区変、プラン変更、退院、状態変化等の理由が記載されていない。 ",null,"課題の分析"]
[null,null,2,"かかりつけ医",null,"3：かかりつけ医と連携が取れている様子が伺える。\n2：かかりつけ医が1か所以上記載されている。\n1：かかりつけ医が記載されていない。",null,"疾病・心身状態の把握"]
[null,null,3,"既往歴の有無・内容",null,"2：既往歴の有無と内容が記載されている。\n1：既往歴の有無と内容が記載されていない。\n他：主治医意見書の「既往歴」欄に病歴の記載がない。",null,"疾病・心身状態の把握"]
[null,null,4,"主傷病",null,"2：主傷病が記載されている。\n1：主傷病が記載されていない。",null,"疾病・心身状態の把握"]
[null,null,5,"内服薬・処置",null,"2：内服薬・処置が記載されている。内服薬・処置ともに無い場合は、その旨が記載されている。\n1：2に該当しない。\n【お薬手帳のコピー等が添付されている場合でも、「2」としてください。】",null,"疾病・心身状態の把握"]
[null,null,6,"ADL",null,"3：①②両方に該当する。\n2：①②のいずれかが該当する。\n1：上記に該当しない。\n\n① 起居移動（寝返り・起きあがり・座位保持・立位保持・立ち上がり・移乗・移動方法・歩行・階段昇降等）の状況が記載されている。\n② 食事、整容、更衣、入浴、トイレ動作等の状況が記載されている。",null,"生活の全体像の把握"]
[null,null,7,"IADL",null,"3：①～⑧すべて記載されている。（明らかに該当しない項目を除く。 例：寝たきりの方の車の運転等）\n2：①～⑧のうち半分以上が記載されている。\n1：上記に該当しない。\n\n① 調理\n② 掃除\n③ 洗濯\n④ 買物\n⑤ 服薬管理\n⑥ 金銭管理\n⑦ 電話\n⑧ 外出時の移動手段（交通機関の利用、車の運転等）",null,"生活の全体像の把握"]
[null,null,8,"認知機能や判断能力",null,"3：①②両方に該当する。\n2：①②のいずれかに該当する。\n1：上記に該当しない。\n\n① 日常の意思決定を行うための認知機能の程度、判断能力の状況が記載されている。\n② （認知症と診断されている場合）中核症状及び行動・心理症状の状況（症状が見られる頻度や状況、背景になりうる要因等）が記載されている。\n【認知症でない場合は、日常の意思決定を行うための認知機能の程度、判断能力の状況が記載されていれば「３」としてください。】",null,"疾病・心身状態の把握"]
{"$rows_left_out":55}
{"sheet":"評価区分シート","index":1,"n_rows":111,"n_cols":11,"rows_kept":111,"cut":false,"hidden":false,"merged":[[125,2,125,10],[126,2,126,10],[120,2,120,10],[121,2,121,10],[122,2,122,10],[123,2,123,10],[124,2,124,10],[115,2,115,10],[116,2,116,10],[117,2,117,10],[118,2,118,10],[119,2,119,10],[110,2,110,10],[111,2,111,10],[112,2,112,10],[113,2,113,10],[114,2,114,10],[51,2,51,10],[46,2,46,10],[47,2,47,10],[48,2,48,10],[49,2,49,10],[50,2,50,10],[74,2,74,10],[105,2,105,10],[106,2,106,10],[107,2,107,10],[95,2,95,10],[97,2,97,10],[98,2,98,10],[99,2,99,10],[102,2,102,10],[103,2,103,10],[96,2,96,10],[104,2,104,10],[59,2,59,10],[73,2,73,10],[94,2,94,10],[75,2,75,10],[78,2,78,10],[79,2,79,10],[81,2,81,10],[82,2,82,10],[83,2,83,10],[80,2,80,10],[88,2,88,10],[86,2,86,10],[87,2,87,10],[89,2,89,10],[90,2,90,10],[91,2,91,10],[7,2,8,2],[7,10,8,10],[72,2,72,10],[66,2,66,10],[67,2,67,10],[70,2,70,10],[71,2,71,10],[62,2,62,10],[63,2,63,10],[65,2,65,10],[56,2,56,10],[64,2,64,10],[54,2,54,10],[55,2,55,10],[57,2,57,10],[58,2,58,10]]}
[{"$f":"\"点検日：\"&TEXT(点検結果記載シート!E7&\"\",\"yyyy/m/d\")","v":"点検日："}]
[{"$f":"\"保険者名：\"&点検結果記載シート!E8","v":"保険者名："}]
[{"$f":"\"点検者名：\"&点検結果記載シート!E9","v":"点検者名："}]
[{"$f":"\"ケアマネジャー名：\"&点検結果記載シート!E10","v":"ケアマネジャー名："}]
[{"$f":"\"事業所名：\"&点検結果記載シート!E11","v":"事業所名："}]
[{"$f":"\"被保険者名：\"&点検結果記載シート!E12","v":"被保険者名："}]
[]
[null,null,"評価\n区分",null,null,null,null,null,null,null,"運営判定\n基準"]
[null,null,null,"生活の\n全体像\nの把握","疾病・\n心身状態\nの把握","主訴・意思\nの把握・尊重","課題の\n分析","課題を解決\nするための\nサービス計画","家族の状況\nの把握と支援","多職種\nとの連携"]
[]
[]
[]
[]
[]
[]
[]
[]
[]
[]
[]
{"$rows_left_out":92}
{"sheet":"一括データ管理","index":2,"n_rows":2,"n_cols":77,"rows_kept":2,"cut":false,"hidden":false,"merged":[]}
[]
["点検日","市区町村名","点検者名","ケアマネジャー名","事業所名","被保険者名","課題分析の理由","かかりつけ医","既往歴の有無・内容","主傷病","内服薬・処置","ADL","IADL","認知機能や判断能力","コミュニケーションにおける理解と表出の状況","一日に摂取すべき水分量","実際に摂取した水分量","食事内容・カロリー数","BMI","口腔衛生の状態","排尿、排便の状態","清潔の保持","「一部介助」項目の特記","「見守り」項目の特記","外出頻度、外出先","利用者の主訴・要望","一日の過ごし方","離床、臥床","現在の生活状況","生活歴","家族の主訴・要望","経済状況","本人の役割","課題の確認","課題の分析結果の文章化","家族の状況","家族関係や周辺の社会資源との状況","留意すべき事項","利用者及び家族の生活に対する意向を踏まえた課題分析の結果","総合的な援助の方針における自立の具体性","アセスメントで抽出した課題に基づくニーズの記載","利用者や多職種に理解できる表記","長期目標","短期目標","本人の役割設定","介護保険サービス","福祉用具貸与・販売の種類と利用の理由","介護保険外サービス","利用者の意思を反映したサービス事業所の利用","週間計画の整合性\n（介護保険サービス）","週間計画の整合性\n（インフォーマルサポート）","週間計画の整合性\n（一日の習慣化された活動）","家族の役割設定の整合性","サービス担当者会議の開催","サービス担当者会議への本人の出席","サービス担当者会議への家族の出席","サービス担当者会議へのサービス担当者の出席","サービス担当者会議の議題（検討項目）","サービス担当者会議の検討内容","サービス担当者会議で残された課題","居宅サービス計画の交付の記録","サービス担当者会議の招集","利用者宅への月1回以上の訪問","サービス事業所との連絡・モニタリング内容","変化を捉える視点","本人の心身状態に関する変化の医療者への報告","ケアプランに位置付けられている多職種との連携","ケアプランに位置付けられていない多職種との連携","評価区分","生活の\n全体像\nの把握","疾病・\n心身状態\nの把握","主訴・意思\nの把握・尊重","課題の\n分析","課題を解決\nするための\nサービス計画","家族の状況\nの把握と支援","多職種\nとの連携","運営判定基準"]

{"sheet":"一括データ管理_整形用","index":3,"n_rows":3,"n_cols":31,"rows_kept":3,"cut":false,"hidden":true,"merged":[[12,15,12,17],[13,15,13,17],[14,15,14,17],[2,15,2,17],[3,15,3,17],[4,15,4,17],[5,15,5,17],[11,15,11,17]]}
[]
[]
[null,"点検日","ケアマネジャー名","事業所名","評価区分","生活の\n全体像\nの把握","疾病・\n心身状態\nの把握","主訴・意思\nの把握・尊重","課題の\n分析","課題を解決\nするための\nサービス計画","家族の状況\nの把握と支援","多職種\nとの連携",null,null,null,"名前",null,null,"ケアプラン数","評価区分A","評価区分B","評価区分C","評価区分D","評価区分E","生活の全体像の把握","疾病・心身状態の把握","主訴・意思の把握・尊重","課題の分析","課題を解決するためのサービス計画","家族の状況の把握と支援","多職種との連携"]

{"sheet":"事業所別集計(レーダーチャート比較)","index":4,"n_rows":6,"n_cols":15,"rows_kept":6,"cut":false,"hidden":false,"merged":[]}
[]
[]
[]
[]
[]
[null,"事業所名","ケアプラン数","評価区分A","評価区分B","評価区分C","評価区分D","評価区分E","生活の\n全体像\nの把握","疾病・\n心身状態\nの把握","主訴・意思\nの把握・尊重","課題の\n分析","課題を解決\nするための\nサービス計画","家族の状況\nの把握と支援","多職種\nとの連携"]

{"sheet":"ケアマネジャー別集計(レーダーチャート比較)","index":5,"n_rows":6,"n_cols":15,"rows_kept":6,"cut":false,"hidden":false,"merged":[]}
[]
[]
[]
[]
[]
[null,"ケアマネジャー名","ケアプラン数","評価区分A","評価区分B","評価区分C","評価区分D","評価区分E","生活の\n全体像\nの把握","疾病・\n心身状態\nの把握","主訴・意思\nの把握・尊重","課題の\n分析","課題を解決\nするための\nサービス計画","家族の状況\nの把握と支援","多職種\nとの連携"]

{"sheet":"一括データ管理_整形用(経年)","index":6,"n_rows":0,"n_cols":0,"rows_kept":0,"cut":false,"hidden":true,"merged":[[13,15,13,17],[14,15,14,17],[11,15,11,17],[12,15,12,17]]}

{"sheet":"事業所別集計(経年表示-集合棒グラフ)","index":7,"n_rows":112,"n_cols":15,"rows_kept":112,"cut":false,"hidden":false,"merged":[]}
[]
[]
[]
[]
[]
[null,"事業所別評価区分Aのケアプラン数推移",null,null,null,null,null,null,null,null,null,null,null,null,"事業所別生活の全体像の把握の平均値推移"]
[]
[]
[]
[]
[]
[]
[]
[]
[]
[]
[]
[]
[]
[]
{"$rows_left_out":93}
{"sheet":"ケアマネジャー別集計(経年表示-集合棒グラフ)","index":8,"n_rows":112,"n_cols":15,"rows_kept":112,"cut":false,"hidden":false,"merged":[]}
[]
[]
[]
[]
[]
[null,"ケアマネジャー別評価区分Aのケアプラン数推移",null,null,null,null,null,null,null,null,null,null,null,null,"ケアマネジャー別生活の全体像の把握の平均値推移"]
[]
[]
[]
[]
[]
[]
[]
[]
[]
[]
[]
[]
[]
[]
{"$rows_left_out":93}
{"sheet":"アドバイス文に関する追加説明","index":9,"n_rows":68,"n_cols":4,"rows_kept":68,"cut":false,"hidden":false,"merged":[]}
[]
[]
[]
[]
[]
["No","本文","点検項目の意義","対応例"]
[1,"No.1【課題分析の理由】について面談時確認することをお勧めします。","アセスメントシートに、アセスメントを行うきっかけとなった理由に関する記載があるかどうかを確認します。","\tアセスメントの理由（初回、更新、退院退所時、区分変更等）により、集めるべき情報の量や集め方が異なります。\n\t特に退院退所時、区分変更等の理由では、生活環境の変化や状態の変化等を把握するため、利用者及び家族のみならず、関係機関からの情報も必要となります。\n\tアセスメントに至った経緯等を通して、利用者や家族の生活環境にどのような変化が生じているのかを把握することが重要です。"]
[2,"No.2【かかりつけ医】について面談時確認することをお勧めします。","アセスメントシートにおいて、かかりつけ医が記載されているかを確認します。","\tかかりつけ医及び各疾患の主治医を把握したうえで、本人や家族等が、かかりつけ医等の指示を踏まえて併存疾患の有無、程度、治療状況等の情報を把握できるよう、継続的な受診の確保や専門職間の連携体制を整えることが必要です。\n\tまた、日常とは異なる体調がみられた場合に、それを把握し必要な相手にその変化を伝えられるような体制を整えることも重要です。"]
[3,"No.3【既往歴の有無・内容】について面談時確認することをお勧めします。","アセスメントシートにおいて、既往歴が記載されているかを確認します。","\t要介護状態の高齢者は複数の疾患や障害を抱えています。それらは手術や服薬などの治療、看護により「治癒」や「軽快」するものから、服薬やリハビリテーション、生活管理などを行うことによって今の状態が悪化しないように病気と「うまくつき合う」ものなど実にさまざまです。\n\t健康状態の把握では、各疾患の特徴的な症状が自覚症状（痛み、しびれ、むくみ、熱っぽさ、めまい、息苦しさ、尿量の低下等）として現れることで、日常生活動作（ADL）や日常生活関連動作（IADL）にどのような影響を与えているのかを把握することが大切です。\n\t再発予防や生活の悪化防止には、生活習慣の改善が必要で、起因となっている疾患の管理についての理解が必要です。"]
[4,"No.4【主傷病】について面談時確認することをお勧めします。","アセスメントシートにおいて、主傷病が記載されているかを確認します。","\t要介護状態の高齢者は複数の疾患や障害を抱えています。それらは手術や服薬などの治療、看護により「治癒」や「軽快」するものから、服薬やリハビリテーション、生活管理などを行うことによって今の状態が悪化しないように病気と「うまくつき合う」ものなど実にさまざまです。\n\t健康状態の把握では、各疾患の特徴的な症状が自覚症状（痛み、しびれ、むくみ、熱っぽさ、めまい、息苦しさ、尿量の低下等）として現れることで、日常生活動作（ADL）や日常生活関連動作（IADL）にどのような影響を与えているのかを把握することが大切です。\n\t医療ニーズの高い疾患にかかっている利用者（呼吸器疾患や難病等で在宅酸素や吸引・吸入等が必要な者、胃ろうの設置者、嚥下障害・がん等における終末期の者等）や認知症・精神疾患・精神症状のある利用者等においては、周囲の支援者（家族、医療機関、サービス提供事業所（者）等）からの情報を収集・活用しながら、ケアプランに反映させる視点を持っていることも大切です。\n\tまた、それぞれの症状によっては、専門職（医師、看護師、理学療法士、作業療法士、言語聴覚士、管理栄養士、歯科医師、歯科衛生士等）の意見を聞きながら、予後予測の見立てを行いつつアセスメントする視点が必要です。"]
[5,"No.5【内服薬・処置】について面談時確認することをお勧めします。","アセスメントシートにおいて、服薬内容が記載されているかを確認します。","\t疾患の再発防止あるいは重度化防止のためには服薬が重要であり、処方薬によっては、食事内容の制限や副作用（出血しやすくなる等）についても知っておくことも重要です。また、これらについて利用者本人が可能な限り理解できるように支援することも重要です。\n\t薬やお薬手帳の自己管理ができず、本人から情報収集することが難しい場合がありますが、そうした状況が服薬アドヒアランスの低下に気づくきっかけになる可能性があります。利用者本人から情報を収集することが難しい場合は、家族への聞き取りや、主治医・かかりつけ薬局等との連携等により内服薬を把握するよう努めることが大切です。"]
[6,"No.6【ADL】について面談時確認することをお勧めします。","アセスメントシートにおいて、ADLが記載されているかを確認します。","\t本来有する機能、あるいは残存機能に応じたADL・IADL を発揮することができる体制を整える必要があります。\n\t自ら行うADL・IADL はそれ自体が機能を向上させる機会となるため、状態・状況にあった機能の向上や福祉用具の活用も検討をすることが重要です。\n\tしている動作、していない動作、できる動作、できない動作、できると思われる動作、それらの維持・改善の見込み等をアセスメントすることが大切です。"]
[7,"No.7【IADL】について面談時確認することをお勧めします。","アセスメントシートにおいて、IADLが記載されているかを確認します。","\t本来有する機能、あるいは残存機能に応じたADL・IADL を発揮することができる体制を整える必要があります。\n\t自ら行うADL・IADL はそれ自体が機能を向上させる機会となるため、状態・状況にあった機能の向上や福祉用具の活用も検討をすることが重要です。\n\tしている動作、していない動作、できる動作、できない動作、できると思われる動作、それらの維持・改善の見込み等をアセスメントすることが大切です。"]
[8,"No.8【認知機能や判断能力】について面談時確認することをお勧めします。","アセスメントシートにおいて、日常の意思決定を行うための認知機能の程度、判断能力の状況、認知症と診断されている場合の中核症状及び行動・心理症状の状況（症状が見られる頻度や状況、背景になりうる要因等）が記載されているかを確認します。","\t日常生活における選択において、本人の意向が表明・反映されるように、意向の表明を支える体制を整える必要があります。そのためには、認知機能の程度や判断能力の状況を把握することが大切です。\n\t認知症のある利用者の支援では、中核症状や行動・心理症状の影響により、一見して意思決定が困難であるとみられる場合であっても、本人にとって適切な意思決定がなされながら尊厳を持って暮らしていくことを重視することが大切です。"]
[9,"No.9【コミュニケーションにおける理解と表出の状況】について面談時確認することをお勧めします。","アセスメントシートにおいて、コミュニケーションの理解の状況、コミュニケーションの表出の状況、コミュニケーション機器・方法等に関する記載がされているかを確認します。","\t本人の望む暮らしの実現に向けた、本人の主訴や意向の把握や意思決定支援等のためには、本人のコミュニケーションの状況を正確に確認することが重要です。\n\tコミュニケーションの表出については、視覚、聴覚等の能力だけでなく、言語・非言語における意思疎通や、コミュニケーション機器・方法等（電話、PC、スマートフォンも含む）も確認することが必要です。\n\tコミュニケーションを難しくしている要因を確認し、適切な補助機器の使用や専門職の支援を受けられる環境を整えることが大切です。"]
[10,"No.10【一日に摂取すべき水分量】について面談時確認することをお勧めします。","アセスメントシート（別紙でも可）において、一日に摂取すべき水分量が記載されているかどうかを確認します。","\t高齢者は代謝機能の変化によって、水や電解質のバランスを保つ調整能力の低下や、細胞内の水分量の低下がみられる。そのため、高齢者は水分のバランスを崩して脱水状態を起こしやすい状態にあります。一方で、排尿回数を減らすために、水分を控える傾向がみられたり、のどの渇きの認識が遅れる等、身体が必要とする水分の補給が難しくなる場合があり、水分補給に留意が必要です。\n\t必要十分な水分量を摂取しないと、認知機能の低下への影響とともに、併発疾患がある場合その療養への影響も懸念されるため、予防の観点からも必要な水分量と日常の摂取量を把握することが重要です。\n\t摂取量をアセスメントすることが難しい場合、日常で使用している湯飲みの大きさ、湯飲みに何杯ほどの水やお茶を飲むかを質問する、食事に汁物を付けているかを質問する等、問いかけの工夫をすることで情報収集ができることもあります。\n\tなお、水分や食事の摂取量は自立度が高い利用者であっても不足している場合があり、体調変化の原因をアセスメントする際に重要な情報となることがあります。利用者の自立度を問わず、十分な水分や食事を摂取できているかをアセスメントすることが大切です。"]
[11,"No.11【実際に摂取した水分量】について面談時確認することをお勧めします。","アセスメントシート（別紙でも可）において、一日に摂取すべき水分量が記載されているかどうかを確認します。","\t高齢者は代謝機能の変化によって、水や電解質のバランスを保つ調整能力の低下や、細胞内の水分量の低下がみられる。そのため、高齢者は水分のバランスを崩して脱水状態を起こしやすい状態にあります。一方で、排尿回数を減らすために、水分を控える傾向がみられたり、のどの渇きの認識が遅れる等、身体が必要とする水分の補給が難しくなる場合があり、水分補給に留意が必要です。\n\t必要十分な水分量を摂取しないと、認知機能の低下への影響とともに、併発疾患がある場合その療養への影響も懸念されるため、予防の観点からも必要な水分量と日常の摂取量を把握することが重要です。\n\t摂取量をアセスメントすることが難しい場合、日常で使用している湯飲みの大きさ、湯飲みに何杯ほどの水やお茶を飲むかを質問する、食事に汁物を付けているかを質問する等、問いかけの工夫をすることで情報収集ができることもあります。\n\tなお、水分や食事の摂取量は自立度が高い利用者であっても不足している場合があり、体調変化の原因をアセスメントする際に重要な情報となることがあります。利用者の自立度を問わず、十分な水分や食事を摂取できているかをアセスメントすることが大切です。"]
[12,"No.12【食事内容・カロリー数】について面談時確認することをお勧めします。","アセスメントシート（別紙でも可）において、食事内容・カロリー、BMIが記載されているかどうかを確認します。"," 食事は身体に必要な栄養を補い、健康な身体を維持するために必要です。栄養改善は、疾患の予防、悪化防止、リハビリを行うための基礎体力づくりにもつながるため重要です。\n そのため、体重の増減やBMI値を使って栄養状態を把握することが必要です。"]
[13,"No.13【BMI】について面談時確認することをお勧めします。","アセスメントシート（別紙でも可）において、食事内容・カロリー、BMIが記載されているかどうかを確認します。"," 食事は身体に必要な栄養を補い、健康な身体を維持するために必要です。栄養改善は、疾患の予防、悪化防止、リハビリを行うための基礎体力づくりにもつながるため重要です。\n そのため、体重の増減やBMI値を使って栄養状態を把握することが必要です。"]
[14,"No.14【口腔衛生の状態】について面談時確認することをお勧めします。","アセスメントシートにおいて、口腔の状態について記載されているかを確認します。","\t適切な口腔ケアは健康にとって重要な要素です。口腔の状態と嚥下機能の低下とは密接な関係があり、見逃してしまうと誤嚥性肺炎などを引き起こす原因にもつながります。また、口臭などが原因で、家族や友人などから指摘されたり、敬遠されるなど、コミュニケーションの悪化や、社会参加への気後れなどにもつながる場合があります。\n\t口腔内に異常が表れている場合、味覚に影響して豊かな食生活を阻害するほか、食欲の減少や食事の量、食品数が減少することも考えられます。\n\t正しいかみ合わせは、平衡感覚を保つことや、歯を食いしばることによる瞬発力の発揮につながるため、歯の喪失は咀嚼能力の低下だけでなく、運動能力の低下につながります。正しいかみあわせの確保や健康な歯の維持が必要となります。"]
{"$rows_left_out":49}
{"sheet":"算出パラメータ","index":10,"n_rows":178,"n_cols":23,"rows_kept":178,"cut":false,"hidden":true,"merged":[]}
[]
[null,"凡例"]
[null,null,"設定値"]
[null,null,"算出値"]
[]
[null,"項目別最大の重み一覧",null,null,null,null,null,null,"項目別回答別重み一覧"]
[null,null,"項目No.","評価カテゴリ","項目","OneHotフラグ","項目別の最大重み",null,"項目No.","項目","回答","回答値","回答毎の重み","Key","OneHotフラグ","回答毎のポイント","影響の有無","影響度","最小値","最大値"]
[null,null,1,"課題の分析","課題分析の理由",0,{"$f":"IF(点検結果記載シート!E13=\"他\",0,MAX(P8:P9))","v":-5.8323337671490165E-2},null,1,"課題分析の理由",2,{"$f":"IF(O8=0,IF(Config!$X$7,(K8-S8)/(T8-S8),K8),\"-\")","v":2},1.0073765287757399E-3,{"$f":"I8&K8","v":"12"},{"$f":"VLOOKUP(I8,C:F,4,FALSE)","v":0},{"$f":"IF(O8=1,M8,L8*M8)+$W$16","v":-5.8323337671490165E-2},{"$f":"OR(K8=\"無\",K8=1)","v":false},{"$f":"IF(Q8,VLOOKUP(I8,C:G,5,)-P8,0)","v":0},{"$f":"MIN(K8:K9)","v":1},{"$f":"MAX(K8:K9)","v":2},null,{"$f":"算出シート!D22","v":"生活の全体像の把握"},{"$f":"COUNTIF(D:D,V8)","v":13}]
[null,null,2,"疾病・心身状態の把握","かかりつけ医",0,{"$f":"IF(点検結果記載シート!E14=\"他\",0,MAX(P10:P12))","v":3.5007744582495753E-2},null,1,"課題分析の理由",1,{"$f":"IF(O9=0,IF(Config!$X$7,(K9-S9)/(T9-S9),K9),\"-\")","v":1},1.0073765287757399E-3,"11",0,{"$f":"IF(O9=1,M9,L9*M9)+$W$16","v":-5.9330714200265901E-2},{"$f":"OR(K9=\"無\",K9=1)","v":true},{"$f":"IF(Q9,VLOOKUP(I9,C:G,5,)-P9,0)","v":1.0073765287757358E-3},{"$f":"MIN(K8:K9)","v":1},{"$f":"MAX(K8:K9)","v":2},null,{"$f":"算出シート!E22","v":"疾病・心身状態の把握"},10]
[null,null,3,"疾病・心身状態の把握","既往歴の有無・内容",0,{"$f":"IF(点検結果記載シート!E15=\"他\",0,MAX(P13:P15))","v":-9.0685502590084413E-3},null,2,"かかりつけ医",3,{"$f":"IF(O10=0,IF(Config!$X$7,(K10-S10)/(T10-S10),K10),\"-\")","v":3},3.1781945103845799E-2,"23",0,3.5007744582495753E-2,false,0,{"$f":"MIN(K10:K12)","v":1},{"$f":"MAX(K10:K12)","v":3},null,{"$f":"算出シート!F22","v":"主訴・意思の把握・尊重"},8]
[null,null,4,"疾病・心身状態の把握","主傷病",0,{"$f":"IF(点検結果記載シート!E16=\"他\",0,MAX(P16:P17))","v":0.10115941029746356},null,2,"かかりつけ医",2,{"$f":"IF(O11=0,IF(Config!$X$7,(K11-S11)/(T11-S11),K11),\"-\")","v":2},3.1781945103845799E-2,"22",0,3.2257994786499544E-3,false,0,{"$f":"MIN(K10:K12)","v":1},{"$f":"MAX(K10:K12)","v":3},null,{"$f":"算出シート!G22","v":"課題の分析"},7]
[null,null,5,"疾病・心身状態の把握","内服薬・処置",0,{"$f":"IF(点検結果記載シート!E17=\"他\",0,MAX(P18:P19))","v":0.14509311085700236},null,2,"かかりつけ医",1,{"$f":"IF(O12=0,IF(Config!$X$7,(K12-S12)/(T12-S12),K12),\"-\")","v":1},3.1781945103845799E-2,"21",0,-2.8556145625195845E-2,true,6.3563890207691598E-2,{"$f":"MIN(K10:K12)","v":1},{"$f":"MAX(K10:K12)","v":3},null,{"$f":"算出シート!H22","v":"課題を解決するためのサービス計画"},11]
[null,null,6,"生活の全体像の把握","ADL",0,{"$f":"IF(点検結果記載シート!E18=\"他\",0,MAX(P20:P22))","v":-6.0338090729041644E-2},null,3,"既往歴の有無・内容",2,{"$f":"IF(O13=0,IF(Config!$X$7,(K13-S13)/(T13-S13),K13),\"-\")","v":2},2.5634770235016601E-2,"32",0,-9.0685502590084413E-3,false,0,{"$f":"MIN(K13:K15)","v":1},{"$f":"MAX(K13:K15)","v":2},null,{"$f":"算出シート!I22","v":"家族の状況の把握と支援"},4]
[null,null,7,"生活の全体像の把握","IADL",0,{"$f":"IF(点検結果記載シート!E19=\"他\",0,MAX(P23:P25))","v":-6.0338090729041644E-2},null,3,"既往歴の有無・内容",1,{"$f":"IF(O14=0,IF(Config!$X$7,(K14-S14)/(T14-S14),K14),\"-\")","v":1},2.5634770235016601E-2,"31",0,-3.4703320494025039E-2,true,2.5634770235016598E-2,{"$f":"MIN(K13:K15)","v":1},{"$f":"MAX(K13:K15)","v":2},null,{"$f":"算出シート!J22","v":"多職種との連携"},8]
[null,null,8,"疾病・心身状態の把握","認知機能や判断能力",0,{"$f":"IF(点検結果記載シート!E20=\"他\",0,MAX(P26:P28))","v":-6.0338090729041644E-2},null,3,"既往歴の有無・内容","他",0,2.5634770235016601E-2,"3他",0,-6.0338090729041644E-2,false,0,{"$f":"MIN(K13:K15)","v":1},{"$f":"MAX(K13:K15)","v":2},null,"設問数",{"$f":"SUM(W8:W14)","v":61}]
[null,null,9,"疾病・心身状態の把握","コミュニケーションにおける理解と表出の状況",0,{"$f":"IF(点検結果記載シート!E21=\"他\",0,MAX(P29:P31))","v":0.38208494634539836},null,4,"主傷病",2,{"$f":"IF(O16=0,IF(Config!$X$7,(K16-S16)/(T16-S16),K16),\"-\")","v":2},8.0748750513252601E-2,"42",0,0.10115941029746356,false,0,{"$f":"MIN(K16:K17)","v":1},{"$f":"MAX(K16:K17)","v":2},null,"設問単位での切片の値",{"$f":"Config!$J$40/W15","v":-6.0338090729041644E-2}]
[null,null,10,"生活の全体像の把握","一日に摂取すべき水分量",0,{"$f":"IF(点検結果記載シート!E22=\"他\",0,MAX(P32:P33))","v":5.1361812260464754E-2},null,4,"主傷病",1,{"$f":"IF(O17=0,IF(Config!$X$7,(K17-S17)/(T17-S17),K17),\"-\")","v":1},8.0748750513252601E-2,"41",0,2.0410659784210958E-2,true,8.0748750513252601E-2,{"$f":"MIN(K16:K17)","v":1},{"$f":"MAX(K16:K17)","v":2}]
[null,null,11,"生活の全体像の把握","実際に摂取した水分量",0,{"$f":"IF(点検結果記載シート!E23=\"他\",0,MAX(P34:P35))","v":1.8814401087603752E-2},null,5,"内服薬・処置",2,{"$f":"IF(O18=0,IF(Config!$X$7,(K18-S18)/(T18-S18),K18),\"-\")","v":2},0.102715600793022,"52",0,0.14509311085700236,false,0,{"$f":"MIN(K18:K19)","v":1},{"$f":"MAX(K18:K19)","v":2}]
[null,null,12,"生活の全体像の把握","食事内容・カロリー数",0,{"$f":"IF(点検結果記載シート!E24=\"他\",0,MAX(P36:P38))","v":-6.0338090729041644E-2},null,5,"内服薬・処置",1,{"$f":"IF(O19=0,IF(Config!$X$7,(K19-S19)/(T19-S19),K19),\"-\")","v":1},0.102715600793022,"51",0,{"$f":"IF(O19=1,M19,L19*M19)+$W$16","v":4.2377510063980356E-2},true,0.102715600793022,{"$f":"MIN(K18:K19)","v":1},{"$f":"MAX(K18:K19)","v":2}]
[null,null,13,"疾病・心身状態の把握","BMI",0,{"$f":"IF(点検結果記載シート!E25=\"他\",0,MAX(P39:P40))","v":7.9409265436570564E-2},null,6,"ADL",3,{"$f":"IF(O20=0,IF(Config!$X$7,(K20-S20)/(T20-S20),K20),\"-\")","v":3},0,{"$f":"I20&K20","v":"63"},0,{"$f":"IF(O20=1,M20,L20*M20)+$W$16","v":-6.0338090729041644E-2},false,0,{"$f":"MIN(K20:K22)","v":1},{"$f":"MAX(K20:K22)","v":3}]
{"$rows_left_out":159}
{"sheet":"算出シート","index":11,"n_rows":108,"n_cols":79,"rows_kept":108,"cut":false,"hidden":true,"merged":[[105,31,106,31],[105,32,106,32],[105,33,106,33],[105,41,106,41],[105,25,106,25],[105,26,106,26],[105,27,106,27],[105,39,106,39],[105,34,106,34],[105,21,106,21],[105,18,106,18],[105,19,106,19],[105,20,106,20],[105,30,106,30],[105,22,106,22],[105,24,106,24],[105,23,106,23],[105,28,106,28],[105,29,106,29],[105,3,106,3],[105,4,106,4],[105,5,106,5],[105,7,106,7],[105,8,106,8],[105,9,106,9],[105,10,106,10],[105,11,106,11],[105,12,106,12],[105,17,106,17],[105,15,106,15],[105,16,106,16],[105,13,106,13],[105,14,106,14],[105,57,106,57],[105,58,106,58],[105,59,106,59],[105,48,106,48],[105,51,106,51],[105,52,106,52],[105,53,106,53],[105,54,106,54],[105,55,106,55],[104,70,104,78],[105,2,106,2],[105,6,106,6],[105,66,106,66],[105,67,106,67],[105,68,106,68],[105,69,106,69],[105,61,106,61],[105,62,106,62],[105,63,106,63],[105,64,106,64],[105,65,106,65],[105,60,106,60],[105,49,106,49],[105,50,106,50],[105,56,106,56],[105,47,106,47],[105,44,106,44],[105,45,106,45],[105,35,106,35],[105,36,106,36],[105,37,106,37],[105,38,106,38],[105,40,106,40],[105,46,106,46],[105,42,106,42],[105,43,106,43]]}
[]
[null,"凡例"]
[null,null,"自動算出項目"]
[null,null,"手動設定項目"]
[]
[null,"算出ロック"]
[null,null,"算出ロック",false]
[null,null,null," "]
[null,"エラー判定(TRUE：エラー、FALSE：正常)"]
[null,null,"必須チェック",{"$f":"OR(E40:E101)","v":true}]
[null,null,"質問エラー判定結果",{"$f":"OR(F40:F101)","v":false}]
[null,null,"カテゴリ設定エラー判定",{"$f":"OR(H40:H101)","v":false}]
[null,null,"係数設定エラー判定",{"$f":"OR(J40:J101)","v":false}]
[null,null,"総合エラー判定",{"$f":"OR(D10:D13)","v":true}]
[]
[null,"運用判定基準(TRUE：エラー、FALSE：正常)"]
[null,null,"基準の入力値",{"$f":"点検結果記載シート!E54&点検結果記載シート!E55&点検結果記載シート!E60&点検結果記載シート!E63&点検結果記載シート!E64&点検結果記載シート!E65&点検結果記載シート!E67&点検結果記載シート!E68&点検結果記載シート!E69&点検結果記載シート!E70","v":""}]
[null,null,"全ての項目が入力されているか",{"$f":"LEN(D17)<>COUNTIF(点検結果記載シート!G:G,Config!J46)","v":true}]
[null,null,"無の項目が存在しないか",{"$f":"ISERROR(FIND(Config!J47,D17,1))=FALSE","v":false}]
[]
{"$rows_left_out":89}
{"sheet":"files","index":12,"n_rows":4,"n_cols":8,"rows_kept":4,"cut":false,"hidden":false,"merged":[]}
[]
[null,null,null,null,null,null,"総数",{"$f":"COUNTA(A:A)","v":0}]
[null,null,null,null,null,null,"正常終了",{"$f":"COUNTIF(B:B,Config!U12)","v":0}]
[null,null,null,null,null,null,"異常終了",{"$f":"COUNTIF(B:B,Config!U13)","v":0}]

{"sheet":"Config","index":13,"n_rows":60,"n_cols":24,"rows_kept":60,"cut":false,"hidden":true,"merged":[[19,9,19,11],[20,9,20,11],[22,9,22,11],[5,19,5,20],[5,2,5,3],[5,5,5,6],[5,8,5,11],[16,9,16,11],[10,9,10,11],[6,9,6,11],[7,9,7,11],[8,9,8,11],[5,16,5,17],[5,13,5,14],[58,9,58,11],[59,9,59,11],[5,22,5,23],[24,9,24,11],[25,9,25,11],[26,9,26,11],[9,9,9,11],[11,9,11,11],[12,9,12,11],[13,9,13,11],[14,9,14,11],[15,9,15,11],[23,9,23,11],[21,9,21,11],[17,9,17,11],[18,9,18,11]]}
[]
[null,"凡例"]
[null,null,"数値"]
[null,null,"文字列"]
[]
[null,null,"点検結果記載シート",null,null,"採点結果記載シート",null,null,"算出シート",null,null,null,null,"アドバイスシート",null,null,"一括データ管理",null,null,"files",null,null,"算出パラメータ"]
[null,null,"名称","点検結果記載シート",null,"名称","評価区分シート",null,"名称","算出シート",null,null,null,"名称","アドバイス文に関する追加説明",null,"名称","一括データ管理",null,"名称","files",null,"正規化On/Off（True：On,False：Off）",false]
[null,null,"入力列","E",null,"総合判定出力列",3,null,"総合判定出力列",12,null,null,null,"アドバイス列","C",null,"実行マクロ名称","AddResult",null,"ファイル名列",1]
[null,null,"バックアップ列","K",null,"生活の全体像の把握出力列",4,null,"生活の全体像の把握判定列",4,null,null,null,null,null,null,"取込対象ファイルフィルター","*.xlsm",null,"処理結果列",2]
[null,null,"設問開始行",7,null,"疾病・心身状態の把握出力列",5,null,"疾病・心身状態の把握判定列",5,null,null,null,null,null,null,"タイトル行",2,null,"正常カウント","H3"]
[null,null,"設問終了行",75,null,"主訴・意思の把握・尊重出力列",6,null,"主訴・意思の把握・尊重判定列",6,null,null,null,null,null,null,"タイトル列数",77,null,"異常カウント","H4"]
[null,null,null,null,null,"課題の分析出力列",7,null,"課題の分析判定列",7,null,null,null,null,null,null,"データ検索起点セル","A65535",null,"正常表記","OK"]
[null,null,null,null,null,"課題を解決するためのサービス計画出力列",8,null,"課題を解決するためのサービス計画判定列",8,null,null,null,null,null,null,null,null,null,"異常表記","Error"]
[null,null,null,null,null,"家族の状況の把握と支援出力列",9,null,"家族の状況の把握と支援判定列",9]
[null,null,null,null,null,"多職種との連携出力列",10,null,"多職種との連携判定列",10]
[null,null,null,null,null,"運用判定基準出力列",11,null,"運用判定基準判定列",13]
[null,null,null,null,null,"点検結果タイトル行",9,null,"ID番号出力列",3]
[null,null,null,null,null,"点検結果出力行",10,null,"質問カテゴリ列",7]
[null,null,null,null,null,"結果出力範囲","CheckResult",null,"影響度出力列",11]
[null,null,null,null,null,"重点ポイントアドバイス出力範囲","FocusPointAdvice",null,"アドバイス出力数リンク先出力列",12]
{"$rows_left_out":40}