{"text_format":"1","workbook":"xlsx","n_sheets":8,"sheets":["銘柄コード登録票","薬効大分類","薬効分類結合","薬効小分類","剤型","用途区分","年月日","区分"],"not_rendered":{"charts":0,"images":0,"macros":1,"external_links":0,"defined_names":53,"comments":1,"pivot_tables":0},"unopened":[],"bounds":{"document_bytes":16777216,"sheet_cells":100000,"rows_first":2000,"rows_last":500,"rows_between":2000,"halvings":0,"cell_chars":16384,"cell_head_chars":4096},"cells_cut":0,"cells_raw":0,"read":"whole","date_system":"1900"}

{"sheet":"銘柄コード登録票","index":0,"n_rows":21,"n_cols":18,"rows_kept":21,"cut":false,"hidden":false,"merged":[[7,1,7,2],[9,10,9,12],[9,17,10,17],[9,16,10,16],[6,1,6,2]]}
["医薬品銘柄コード登録票"]
["・下記①～⑫欄に記入の上、「エラーチェック」をクリックして、記入エラーがないかご確認ください。エラーがある場合は修正してください。\n"]
["・記入エラーがないことを確認後、厚生労働省 医政局 医薬産業振興・医療情報企画課 調査統計係 宛てメールでお送りください。メールアドレス：sppind@mhlw.go.jp"]
["・調査統計係から「医薬品銘柄コード」欄に記入済みのものをメールで返信いたします。"]
["・行が足りない場合は、最下行をコピーして、その下の行に貼り付けて使用してください。(※正しく行わないとExcelの関数/マクロが働かない場合があります。)"]
[]
[null,"①製造販売業者　調査対象者ID（ykを除く９桁の数字）",null,null,"②製造販売業者　名称"]
[]
[]
[null,null,null,null,null,null,null,null,null,null,"⑧承認/承認整理年月日（西暦）",null,null,null,null,null,"⑫医薬品銘柄コード\n（承継、変更、削除の場合 要記入）","医薬品銘柄コード\n（記入不要）"]
[null,"③薬効大分類","薬効大分類名","④薬効小分類","薬効小分類名","⑤剤型","剤型名","⑥用途区分","用途区分","⑦承認番号（16桁）","年","月","日","⑨販売名","⑩販売名フリガナ","⑪区分"]
[1,null,{"$f":"IF(ISERROR(VLOOKUP($B12,薬効大分類!A:B,2,FALSE)),\"\",VLOOKUP($B12,薬効大分類!A:B,2,FALSE))","v":""},null,{"$f":"IF(ISERROR(VLOOKUP(D12,薬効小分類!A:B,2,FALSE)),\"\",VLOOKUP(D12,薬効小分類!A:B,2,FALSE))","v":""},null,{"$f":"IF(ISERROR(VLOOKUP(F12,剤型!A:B,2,FALSE)),\"\",VLOOKUP(F12,剤型!A:B,2,FALSE))","v":""},null,{"$f":"IF(ISERROR(VLOOKUP(H12,用途区分!A:B,2,FALSE)),\"\",VLOOKUP(H12,用途区分!A:B,2,FALSE))","v":""}]
[2,null,{"$f":"IF(ISERROR(VLOOKUP($B13,薬効大分類!A:B,2,FALSE)),\"\",VLOOKUP($B13,薬効大分類!A:B,2,FALSE))","v":""},null,{"$f":"IF(ISERROR(VLOOKUP(D13,薬効小分類!A:B,2,FALSE)),\"\",VLOOKUP(D13,薬効小分類!A:B,2,FALSE))","v":""},null,{"$f":"IF(ISERROR(VLOOKUP(F13,剤型!A:B,2,FALSE)),\"\",VLOOKUP(F13,剤型!A:B,2,FALSE))","v":""},null,{"$f":"IF(ISERROR(VLOOKUP(H13,用途区分!A:B,2,FALSE)),\"\",VLOOKUP(H13,用途区分!A:B,2,FALSE))","v":""}]
[3,null,{"$f":"IF(ISERROR(VLOOKUP($B14,薬効大分類!A:B,2,FALSE)),\"\",VLOOKUP($B14,薬効大分類!A:B,2,FALSE))","v":""},null,{"$f":"IF(ISERROR(VLOOKUP(D14,薬効小分類!A:B,2,FALSE)),\"\",VLOOKUP(D14,薬効小分類!A:B,2,FALSE))","v":""},null,{"$f":"IF(ISERROR(VLOOKUP(F14,剤型!A:B,2,FALSE)),\"\",VLOOKUP(F14,剤型!A:B,2,FALSE))","v":""},null,{"$f":"IF(ISERROR(VLOOKUP(H14,用途区分!A:B,2,FALSE)),\"\",VLOOKUP(H14,用途区分!A:B,2,FALSE))","v":""}]
[4,null,{"$f":"IF(ISERROR(VLOOKUP($B15,薬効大分類!A:B,2,FALSE)),\"\",VLOOKUP($B15,薬効大分類!A:B,2,FALSE))","v":""},null,{"$f":"IF(ISERROR(VLOOKUP(D15,薬効小分類!A:B,2,FALSE)),\"\",VLOOKUP(D15,薬効小分類!A:B,2,FALSE))","v":""},null,{"$f":"IF(ISERROR(VLOOKUP(F15,剤型!A:B,2,FALSE)),\"\",VLOOKUP(F15,剤型!A:B,2,FALSE))","v":""},null,{"$f":"IF(ISERROR(VLOOKUP(H15,用途区分!A:B,2,FALSE)),\"\",VLOOKUP(H15,用途区分!A:B,2,FALSE))","v":""}]
[5,null,{"$f":"IF(ISERROR(VLOOKUP($B16,薬効大分類!A:B,2,FALSE)),\"\",VLOOKUP($B16,薬効大分類!A:B,2,FALSE))","v":""},null,{"$f":"IF(ISERROR(VLOOKUP(D16,薬効小分類!A:B,2,FALSE)),\"\",VLOOKUP(D16,薬効小分類!A:B,2,FALSE))","v":""},null,{"$f":"IF(ISERROR(VLOOKUP(F16,剤型!A:B,2,FALSE)),\"\",VLOOKUP(F16,剤型!A:B,2,FALSE))","v":""},null,{"$f":"IF(ISERROR(VLOOKUP(H16,用途区分!A:B,2,FALSE)),\"\",VLOOKUP(H16,用途区分!A:B,2,FALSE))","v":""}]
[6,null,{"$f":"IF(ISERROR(VLOOKUP($B17,薬効大分類!A:B,2,FALSE)),\"\",VLOOKUP($B17,薬効大分類!A:B,2,FALSE))","v":""},null,{"$f":"IF(ISERROR(VLOOKUP(D17,薬効小分類!A:B,2,FALSE)),\"\",VLOOKUP(D17,薬効小分類!A:B,2,FALSE))","v":""},null,{"$f":"IF(ISERROR(VLOOKUP(F17,剤型!A:B,2,FALSE)),\"\",VLOOKUP(F17,剤型!A:B,2,FALSE))","v":""},null,{"$f":"IF(ISERROR(VLOOKUP(H17,用途区分!A:B,2,FALSE)),\"\",VLOOKUP(H17,用途区分!A:B,2,FALSE))","v":""}]
[7,null,{"$f":"IF(ISERROR(VLOOKUP($B18,薬効大分類!A:B,2,FALSE)),\"\",VLOOKUP($B18,薬効大分類!A:B,2,FALSE))","v":""},null,{"$f":"IF(ISERROR(VLOOKUP(D18,薬効小分類!A:B,2,FALSE)),\"\",VLOOKUP(D18,薬効小分類!A:B,2,FALSE))","v":""},null,{"$f":"IF(ISERROR(VLOOKUP(F18,剤型!A:B,2,FALSE)),\"\",VLOOKUP(F18,剤型!A:B,2,FALSE))","v":""},null,{"$f":"IF(ISERROR(VLOOKUP(H18,用途区分!A:B,2,FALSE)),\"\",VLOOKUP(H18,用途区分!A:B,2,FALSE))","v":""}]
[8,null,{"$f":"IF(ISERROR(VLOOKUP($B19,薬効大分類!A:B,2,FALSE)),\"\",VLOOKUP($B19,薬効大分類!A:B,2,FALSE))","v":""},null,{"$f":"IF(ISERROR(VLOOKUP(D19,薬効小分類!A:B,2,FALSE)),\"\",VLOOKUP(D19,薬効小分類!A:B,2,FALSE))","v":""},null,{"$f":"IF(ISERROR(VLOOKUP(F19,剤型!A:B,2,FALSE)),\"\",VLOOKUP(F19,剤型!A:B,2,FALSE))","v":""},null,{"$f":"IF(ISERROR(VLOOKUP(H19,用途区分!A:B,2,FALSE)),\"\",VLOOKUP(H19,用途区分!A:B,2,FALSE))","v":""}]
[9,null,{"$f":"IF(ISERROR(VLOOKUP($B20,薬効大分類!A:B,2,FALSE)),\"\",VLOOKUP($B20,薬効大分類!A:B,2,FALSE))","v":""},null,{"$f":"IF(ISERROR(VLOOKUP(D20,薬効小分類!A:B,2,FALSE)),\"\",VLOOKUP(D20,薬効小分類!A:B,2,FALSE))","v":""},null,{"$f":"IF(ISERROR(VLOOKUP(F20,剤型!A:B,2,FALSE)),\"\",VLOOKUP(F20,剤型!A:B,2,FALSE))","v":""},null,{"$f":"IF(ISERROR(VLOOKUP(H20,用途区分!A:B,2,FALSE)),\"\",VLOOKUP(H20,用途区分!A:B,2,FALSE))","v":""}]
[10,null,{"$f":"IF(ISERROR(VLOOKUP($B21,薬効大分類!A:B,2,FALSE)),\"\",VLOOKUP($B21,薬効大分類!A:B,2,FALSE))","v":""},null,{"$f":"IF(ISERROR(VLOOKUP(D21,薬効小分類!A:B,2,FALSE)),\"\",VLOOKUP(D21,薬効小分類!A:B,2,FALSE))","v":""},null,{"$f":"IF(ISERROR(VLOOKUP(F21,剤型!A:B,2,FALSE)),\"\",VLOOKUP(F21,剤型!A:B,2,FALSE))","v":""},null,{"$f":"IF(ISERROR(VLOOKUP(H21,用途区分!A:B,2,FALSE)),\"\",VLOOKUP(H21,用途区分!A:B,2,FALSE))","v":""}]

{"sheet":"薬効大分類","index":1,"n_rows":38,"n_cols":2,"rows_kept":38,"cut":false,"hidden":false,"merged":[]}
[11,"中枢神経系用薬"]
[12,"末梢神経系用薬"]
[13,"感覚器官用薬"]
[19,"その他の神経系及び感覚器官用医薬品"]
[21,"循環器官用薬"]
[22,"呼吸器官用薬"]
[23,"消化器官用薬"]
[24,"ホルモン剤（抗ホルモン剤を含む。）"]
[25,"泌尿生殖器官及び肛門用薬"]
[26,"外皮用薬"]
[27,"歯科口腔用薬"]
[29,"その他の個々の器官系用医薬品"]
[31,"ビタミン剤"]
[32,"滋養強壮薬"]
[33,"血液・体液用薬"]
[34,"人工透析用薬"]
[39,"その他の代謝性医薬品"]
[41,"細胞賦活用薬"]
[42,"腫瘍用薬"]
[43,"放射性医薬品"]
[44,"アレルギー用薬"]
[49,"その他の組織細胞機能用医薬品"]
[51,"生薬"]
[52,"漢方製剤"]
[59,"その他の生薬及び漢方処方に基づく医薬品"]
[61,"抗生物質製剤"]
[62,"化学療法剤"]
[63,"生物学的製剤"]
[64,"寄生動物用薬"]
[69,"その他の病原生物に対する医薬品"]
[71,"調剤用薬"]
[72,"診断用薬（体外診断用医薬品を除く。）"]
[73,"公衆衛生用薬"]
[74,"体外診断用医薬品"]
[79,"その他の治療を主目的としない医薬品"]
[81,"アルカロイド系麻薬（天然麻薬）"]
[82,"非アルカロイド系麻薬"]
[89,"その他の麻薬"]

{"sheet":"薬効分類結合","index":2,"n_rows":9,"n_cols":38,"rows_kept":9,"cut":false,"hidden":false,"merged":[]}
[111,121,131,190,211,221,231,241,251,261,271,290,311,321,331,341,391,411,421,430,441,490,510,520,590,611,621,631,641,690,711,721,731,741,791,811,821,890]
[112,122,132,null,212,222,232,242,252,262,272,null,312,322,332,342,392,412,422,null,442,null,null,null,null,612,622,632,642,null,712,722,732,742,799,812,829]
[113,123,133,null,213,223,233,243,253,263,273,null,313,323,333,349,393,419,423,null,443,null,null,null,null,613,623,633,649,null,713,729,733,743,null,819]
[114,124,139,null,214,224,234,244,254,264,274,null,314,324,339,null,394,null,424,null,449,null,null,null,null,614,624,634,null,null,714,null,734,744]
[115,125,null,null,215,225,235,245,255,265,275,null,315,325,null,null,395,null,429,null,null,null,null,null,null,615,625,635,null,null,715,null,735,745]
[116,129,null,null,216,226,236,246,259,266,276,null,316,326,null,null,396,null,null,null,null,null,null,null,null,616,629,636,null,null,719,null,739,746]
[117,null,null,null,217,229,237,247,null,267,279,null,317,327,null,null,397,null,null,null,null,null,null,null,null,617,null,639]
[118,null,null,null,218,null,239,248,null,268,null,null,319,329,null,null,399,null,null,null,null,null,null,null,null,619]
[119,null,null,null,219,null,null,249,null,269]

{"sheet":"薬効小分類","index":3,"n_rows":178,"n_cols":2,"rows_kept":178,"cut":false,"hidden":false,"merged":[]}
[111,"全身麻酔剤"]
[112,"催眠鎮静剤，抗不安剤"]
[113,"抗てんかん剤"]
[114,"解熱鎮痛消炎剤"]
[115,"興奮剤，覚せい剤"]
[116,"抗パーキンソン剤"]
[117,"精神神経用剤"]
[118,"総合感冒剤"]
[119,"その他の中枢神経系用薬"]
[121,"局所麻酔剤"]
[122,"骨格筋弛緩剤"]
[123,"自律神経剤"]
[124,"鎮けい剤"]
[125,"発汗剤、止汗剤"]
[129,"その他の末梢神経系用薬"]
[131,"眼科用剤"]
[132,"耳鼻科用剤"]
[133,"鎮暈剤"]
[139,"その他の感覚器官用薬"]
[190,"その他の神経系及び感覚器官用医薬品"]
[211,"強心剤"]
[212,"不整脈用剤"]
[213,"利尿剤"]
[214,"血圧降下剤"]
[215,"血管補強剤"]
[216,"血管収縮剤"]
[217,"血管拡張剤"]
[218,"高脂血症用剤"]
[219,"その他の循環器官用薬"]
[221,"呼吸促進剤"]
[222,"鎮咳剤"]
[223,"去たん剤"]
[224,"鎮咳去たん剤"]
[225,"気管支拡張剤"]
[226,"含嗽剤"]
[229,"その他の呼吸器官用薬"]
[231,"止しゃ剤，整腸剤"]
[232,"消化性潰瘍用剤"]
[233,"健胃消化剤"]
[234,"制酸剤"]
[235,"下剤，浣腸剤"]
[236,"利胆剤"]
[237,"複合胃腸剤"]
[239,"その他の消化器官用薬"]
[241,"脳下垂体ホルモン剤"]
[242,"唾液腺ホルモン剤"]
[243,"甲状腺，副甲状腺ホルモン剤"]
[244,"たん白同化ステロイド剤"]
[245,"副腎ホルモン剤"]
[246,"男性ホルモン剤"]
[247,"卵胞ホルモン及び黄体ホルモン剤"]
[248,"混合ホルモン剤"]
[249,"その他のホルモン剤（抗ホルモン剤を含む。）"]
[251,"泌尿器官用剤"]
[252,"生殖器官用剤（性病予防剤を含む。）"]
[253,"子宮収縮剤"]
[254,"避妊剤"]
[255,"痔疾用剤"]
[259,"その他の泌尿生殖器官及び肛門用薬"]
[261,"外皮用殺菌消毒剤"]
[262,"創傷保護剤"]
[263,"化膿性疾患用剤"]
[264,"鎮痛，鎮痒，収斂，消炎剤"]
[265,"寄生性皮ふ疾患用剤"]
[266,"皮ふ軟化剤（腐しょく剤を含む。）"]
[267,"毛髪用剤（発毛剤，脱毛剤，染毛剤，養毛剤）"]
[268,"浴剤"]
[269,"その他の外皮用薬"]
[271,"歯科用局所麻酔剤"]
[272,"歯髄失活剤"]
[273,"歯科用鎮痛鎮静剤（根管及び齲窩消毒剤を含む。）"]
[274,"歯髄乾屍剤（根管充填剤を含む。）"]
[275,"歯髄覆罩剤"]
[276,"歯科用抗生物質製剤"]
[279,"その他の歯科口腔用薬"]
[290,"その他の個々の器官系用医薬品"]
[311,"ビタミンＡ及びＤ剤"]
[312,"ビタミンＢ１剤"]
[313,"ビタミンＢ剤（ビタミンＢ１剤を除く。）"]
[314,"ビタミンＣ剤"]
[315,"ビタミンＥ剤"]
[316,"ビタミンＫ剤"]
[317,"混合ビタミン剤（ビタミンＡ・Ｄ混合製剤を除く。）"]
[319,"その他のビタミン剤"]
[321,"カルシウム剤"]
[322,"無機質製剤"]
[323,"糖類剤"]
[324,"有機酸製剤"]
[325,"たん白アミノ酸製剤"]
[326,"臓器製剤"]
[327,"乳幼児用剤"]
[329,"その他の滋養強壮薬"]
[331,"血液代用剤"]
[332,"止血剤"]
[333,"血液凝固阻止剤"]
[339,"その他の血液・体液用薬"]
[341,"人工腎臓透析用剤"]
[342,"腹膜透析用剤"]
[349,"その他の人工透析用薬"]
[391,"肝臓疾患用剤"]
[392,"解毒剤"]
[393,"習慣性中毒用剤"]
[394,"痛風治療剤"]
[395,"酵素製剤"]
[396,"糖尿病用剤"]
[397,"総合代謝性製剤"]
[399,"他に分類されない代謝性医薬品"]
[411,"クロロフィル製剤"]
[412,"色素製剤"]
[419,"その他の細胞賦活用薬"]
[421,"アルキル化剤"]
[422,"代謝拮抗剤"]
[423,"抗腫瘍性抗生物質製剤"]
[424,"抗腫瘍性植物成分製剤"]
[429,"その他の腫瘍用薬"]
[430,"放射性医薬品"]
[441,"抗ヒスタミン剤"]
[442,"刺激療法剤"]
[443,"非特異性免疫原製剤"]
[449,"その他のアレルギー用薬"]
[490,"その他の組織細胞機能用医薬品"]
[510,"生薬"]
[520,"漢方製剤"]
[590,"その他の生薬及び漢方処方に基づく医薬品"]
[611,"主としてグラム陽性菌に作用する抗生物質製剤"]
[612,"主としてグラム陰性菌に作用する抗生物質製剤"]
[613,"主としてグラム陽性・陰性菌に作用する抗生物質製剤"]
[614,"主としてグラム陽性菌，マイコプラズマに作用する抗生物質製剤"]
[615,"主としてグラム陽性・陰性菌，リケッチア，クラミジアに作用する抗生物質製剤"]
[616,"主として抗酸菌に作用する抗生物質製剤"]
[617,"主としてカビに作用する抗生物質製剤"]
[619,"その他の抗生物質製剤（複合抗生物質製剤を含む。）"]
[621,"サルファ剤"]
[622,"抗結核剤"]
[623,"抗ハンセン病剤"]
[624,"合成抗菌剤"]
[625,"抗ウイルス剤"]
[629,"その他の化学療法剤"]
[631,"ワクチン類"]
[632,"毒素及びトキソイド類"]
[633,"抗毒素類及び抗レプトスピラ血清類"]
[634,"血液製剤類"]
[635,"生物学的試験用製剤類"]
[636,"混合生物学的製剤"]
[639,"その他の生物学的製剤"]
[641,"抗原虫剤"]
[642,"駆虫剤"]
[649,"その他の寄生動物用薬"]
[690,"その他の病原生物に対する医薬品"]
[711,"賦形剤"]
[712,"軟膏基剤"]
[713,"溶解剤"]
[714,"矯味，矯臭，着色剤"]
[715,"乳化剤"]
[719,"その他の調剤用薬"]
[721,"Ｘ線造影剤"]
[722,"機能検査用試薬"]
[729,"その他の診断用薬（体外診断用医薬品を除く。）"]
[731,"防腐剤"]
[732,"防疫用殺菌消毒剤"]
[733,"防虫剤"]
[734,"殺虫剤"]
[735,"殺そ剤"]
[739,"その他の公衆衛生用薬"]
[741,"一般検査用試薬"]
[742,"血液検査用試薬"]
[743,"生化学的検査用試薬"]
[744,"免疫血清学的検査用試薬"]
[745,"細菌学的検査用薬"]
[746,"病理組織検査用薬"]
[791,"ばん創こう"]
[799,"他に分類されない治療を主目的としない医薬品"]
[811,"あへんアルカロイド系麻薬"]
[812,"コカアルカロイド系製剤"]
[819,"その他のアルカロイド系麻薬（天然麻薬）"]
[821,"合成麻薬"]
[829,"その他の非アルカロイド系麻薬"]
[890,"その他の麻薬"]

{"sheet":"剤型","index":4,"n_rows":18,"n_cols":2,"rows_kept":18,"cut":false,"hidden":false,"merged":[]}
["A","純品"]
["B","内用粉末剤（散、細粒、顆粒、ｼﾛｯﾌﾟ用剤等を含む）    "]
["C","錠剤（内用に限る。口中錠、除放錠等を含む） "]
["D","ｶﾌﾟｾﾙ剤（腸溶ｶﾌﾟｾﾙ等も含む）"]
["E","内用液剤"]
["F","酒剤、ｴｷｽ剤、流ｴｷｽ剤"]
["G","茶剤、生薬、生薬粉剤    "]
["H","吸入剤  "]
["L","ｴｱｿﾞｰﾙ剤（外用）"]
["M","外用液剤（外用ﾁﾝｷ、浣腸を含む）"]
["N","軟膏、ｸﾘｰﾑ"]
["P","硬膏、ﾊｯﾌﾟ剤、ﾊﾟｽﾀ剤"]
["Q","坐剤（膣錠を含む）"]
["R","丸剤（内用）"]
["T","注射用液剤"]
["U","注射用粉末剤"]
["V","診断用薬（薬価収載品を除く）"]
["Z","その他"]

{"sheet":"用途区分","index":5,"n_rows":5,"n_cols":2,"rows_kept":5,"cut":false,"hidden":false,"merged":[]}
["A","一般用医薬品・要指導医薬品"]
["B","配置用家庭薬"]
["C","医療用医薬品（薬価基準に収載しないもの）"]
["D","一般用・配置用家庭薬（兼用）"]
["E","医療用・一般用医薬品（兼用）"]

{"sheet":"年月日","index":6,"n_rows":79,"n_cols":3,"rows_kept":79,"cut":false,"hidden":false,"merged":[]}
[2027,"01","01"]
[2026,"02","02"]
[2025,"03","03"]
[2024,"04","04"]
[2023,"05","05"]
[2022,"06","06"]
[2021,"07","07"]
[2020,"08","08"]
[2019,"09","09"]
[2018,10,10]
[2017,11,11]
[2016,12,12]
[2015,"00",13]
[2014,null,14]
[2013,null,15]
[2012,null,16]
[2011,null,17]
[2010,null,18]
[2009,null,19]
[2008,null,20]
[2007,null,21]
[2006,null,22]
[2005,null,23]
[2004,null,24]
[2003,null,25]
[2002,null,26]
[2001,null,27]
[2000,null,28]
[1999,null,29]
[1998,null,30]
[1997,null,31]
[1996,null,"00"]
[1995]
[1994]
[1993]
[1992]
[1991]
[1990]
[1989]
[1988]
[1987]
[1986]
[1985]
[1984]
[1983]
[1982]
[1981]
[1980]
[1979]
[1978]
[1977]
[1976]
[1975]
[1974]
[1973]
[1972]
[1971]
[1970]
[1969]
[1968]
[1967]
[1966]
[1965]
[1964]
[1963]
[1962]
[1961]
[1960]
[1959]
[1958]
[1957]
[1956]
[1955]
[1954]
[1953]
[1952]
[1951]
[1950]
["0000"]

{"sheet":"区分","index":7,"n_rows":4,"n_cols":1,"rows_kept":4,"cut":false,"hidden":false,"merged":[]}
["1 新規"]
["2 承継・変更（①②のみ変更）"]
["3 承継・変更（選択肢2以外）"]
["4 削除"]